page-brochureware.php

IBM SDK, Java Technology Edition, Version 7.1 fixes


Fixes, new function, restrictions and documentation for the 32-bit and 64-bit versions of this SDK.

This page was generated on: 28/08/2018

Fixes

Please select the Fix Pack you have installed.

7.1 Service Refresh 4 Fix Pack 30

APAR Defect Component Oracle Bug ID Abstract SR FP Defect Type
Defect Fixes
IJ06110 137905 Class Libraries ENABLING JULES AND PISCES RENDERING ENGINES FOR IBM JAVA. 4 30 Performance
IJ08278 137775 Class Libraries FIX SECURITY VULNERABILITY CVE-2018-1517 4 30 Security Vulnerability
IJ08242 138163 Class Libraries FIX SECURITY VULNERABILITY CVE-2018-2940 4 30 Security Vulnerability
IJ08244 138191 Class Libraries FIX SECURITY VULNERABILITY CVE-2018-2952 4 30 Security Vulnerability
IJ08241 138198 Class Libraries FIX SECURITY VULNERABILITY CVE-2018-2973 4 30 Security Vulnerability
IJ05380 137664 Class Libraries JAVA.UTIL.LOGGING.LEVEL$ KNOWNLEVEL HOLDING THE STRONG REFERENCES TO HASHMAP ENTERIES LEADING TO OUTOFMEMORYERROR. 4 30 Out of Memory
IJ07755 138554 Class Libraries SOCKET COMMUNICATION OVER NIO IN AIX CAUSES HIGH CPU EVEN THOUGH THE CONNECTION IS IDLE. 4 30 Performance
IJ08119 138257 Class Libraries TRANSLATION MESSAGES UPDATE FOR JCL 4 30
IJ07885 137860 Class Libraries UPDATE THE FINGERPRINT OF TTELESECGLOBALROOTCLASS2 CA 4 30 Usability
IJ07986 138491 Class Libraries UPDATE TIMEZONE INFORMATION TO TZDATA2018D AND TZDATA2018E 4 30
IJ06037 119092 Java Virtual Machine CRASH IN JAVA/UTIL/ZIP/ZIPFILE.OP EN() 4 30 Crash
IJ08250 138471 Java Virtual Machine FIX SECURITY VULNERABILITY CVE-2018-12539 4 30 Security Vulnerability
IV89241 115248 Java Virtual Machine SYSTEM PROPERTY ‘SUN.JAVA2D.FONTPATH’ IS NOT SET TO THE VALUE OF ENVIRONMENT VARIABLE ‘JAVA_FONTS’ 4 30 Unexpected Behaviour
IJ07260 138370 JIT Compiler CRASHING BECAUSE OF CORRUPTED STACK-ALLOCATED OBJECT 4 30 Crash
IJ07326 136228 JIT Compiler JAVA JIT: COMPILE TIME CRASH IN JIT LIBRARY. 4 30 Crash
IJ08376 138410 JIT Compiler JAVA OBJECTS ARE KEPT LONGER THAN SHOULD BE 4 30 Functional Issue
IJ07440 136385 JIT Compiler JVM CRASH IN JIT-COMPILED CODE DUE TO MISSING TYPE CHECK 4 30 Crash
IX90186 138708 ORB ON Z/WAS META REQUEST FAILS WITH ORG.OMG.CORBA.NO_IMPLEME NT 4 30
IJ08248 138304 Reliability and Serviceability FIX SECURITY VULNERABILITY CVE-2018-1656 4 30
IJ08063 137546 Security ENHANCEMENT TO CERTPATH VALIDATOR CERTIFICATE EXPIRATION CHECK 4 30
IJ07937 138649 Security UPDATE THE PROVIDER SIGNING CERTIFICATES. 4 30 Functional Issue
IJ07981 137545 Security VALIDATE AND PORT 8196952: BAD PRIMECERTAINTY VALUE SETTING IN DSAPARAMETERGENERATOR 4 30
PH00962 138367 z/OS Extentions ADD SUPPORT IN JZOS FOR 8-CHARACTER TSO/E USERID IN Z/OS V2R3 4 30
PH00965 138565 z/OS Extentions ADD VALIDATION FOR PACKEDDECIMAL FUNCTIONS IN JZOS COM.IBM.JZOS.FIELDS 4 30
PH01801 138691 z/OS Extentions UPDATE THE PROVIDER SIGNING CERTIFICATES. 4 30

7.1 Service Refresh 4 Fix Pack 25

APAR Defect Component Oracle Bug ID Abstract SR FP Defect Type
Defect Fixes
IJ06351 137303 Class Libraries FIX SECURITY VULNERABILITY CVE-2018-2790 4 25 Security Vulnerability
IJ06348 137290 Class Libraries FIX SECURITY VULNERABILITY CVE-2018-2795 4 25 Security Vulnerability
IJ06347 137285 Class Libraries FIX SECURITY VULNERABILITY CVE-2018-2796 4 25 Security Vulnerability
IJ06346 137278 Class Libraries FIX SECURITY VULNERABILITY CVE-2018-2797 4 25 Security Vulnerability
IJ06345 137271 Class Libraries FIX SECURITY VULNERABILITY CVE-2018-2798 4 25 Security Vulnerability
IJ06349 137297 Class Libraries FIX SECURITY VULNERABILITY CVE-2018-2800 4 25 Security Vulnerability
IJ06308 137549 Class Libraries UPDATE TIMEZONE INFORMATION TO TZDATA2018C 4 25
IJ05414 137237 Class Libraries UPGRADE VISUAL C/C++ RUNTIME LIBRARIES SHIPPED WITH IBM JDK ON WINDOWS TO 10.0.40219.325 4 25 Security Vulnerability
IV98212 133292 JIT Compiler ASSERTION IN GC 4 25 Crash
IJ04875 136564 JIT Compiler JAVA JIT: CRASH IN JIT LIBRARY FUNCTION FINDCLASSINFO() 4 25 Crash
IJ05155 135547 JIT Compiler JAVA JIT: CRASH INSIDE A JIT COMPILED SYNRONIZED BLOCK 4 25 Crash
IJ05445 137474 JIT Compiler SEGMENTATION FAULT IN THE JIT JITWALKFRAME 4 25 Crash
IJ06000 137453 JIT Compiler UNEXPECTED DIVIDE BY ZERO EXCEPTION 4 25 Unexpected Behaviour
IJ05754 137836 Security CERTPATH PKIXPARAMETERS CLASS CAUSES NULLPOINTEREXCEPTION 4 25 Exception Thrown
IJ05083 137443 Security CIPHERINPUTSTREAM THAT IS NOT FULLY READ THROWS BADPADDINGEXCEP 4 25 Exception Thrown
IJ06343 135797 Security FIX SECURITY VULNERABILITY CVE-2018-2783 4 25 Security Vulnerability
IJ06342 137249 Security FIX SECURITY VULNERABILITY CVE-2018-2794 4 25 Security Vulnerability
IJ03969 137041 Security IBMPKCS11IMPL CRYPTO PROVIDER – DEBUG TRACING ERROR IN THE PKCS11KEYSTORE CLASS 4 25
IJ05047 137550 Security IBMPKCS11IMPL CRYPTO PROVIDER – SESSION HANDLE IS INVALID EXCEPTION 4 25
IJ05409 137685 Security RECEIVE JKS CERTIFICATE,V1STASH PROBLEM WHEN V2 EXISTS,YEAR 2038 PASSWORD EXPIRY,CMS KEYSTORE WITH RESTRICTED POLICY 4 25
IJ06332 137742 Security UPDATE KRB5LOGINMODULE.DOCALLBA CKS() TO THROW A MORE DESCRIPTIVE”NULL PASSWORD” LOGINEXCEPTION. 4 25
IJ05408 137689 Security V1 STASH PROBLEM WHEN V2 STASH EXISTS, CMS KEYSTORE PROBLEM WITH RESTRICTED POLICY FILE 4 25
IJ04910 137442 Security WHILE USING LDAP CRL, THE CRL DISTRIBUTION POINT TIMEOUT VALUE IS IGNORED. 4 25 Performance
IJ06344 137266 XML FIX SECURITY VULNERABILITY CVE-2018-2799 4 25 Security Vulnerability
PI95513 136983 z/OS Extentions JZOS ZFILE.READJFCB MEMORY LEAK 4 25 Out of Memory
PI95008 137136 z/OS Extentions MEMORY LEAK WHEN USING JZOS ACCESSMETHODSERVICES 4 25 Out of Memory

7.1 Service Refresh 4 Fix Pack 20

APAR Defect Component Oracle Bug ID Abstract SR FP Defect Type
Defect Fixes
IJ04044 135773 Class Libraries FIX SECURITY VULNERABILITY CVE-2018-2599 4 20 Security Vulnerability
IJ04045 135766 Class Libraries FIX SECURITY VULNERABILITY CVE-2018-2602 4 20 Security Vulnerability
IJ04038 135821 Class Libraries FIX SECURITY VULNERABILITY CVE-2018-2634 4 20 Security Vulnerability
IJ04037 135811 Class Libraries FIX SECURITY VULNERABILITY CVE-2018-2637 4 20 Security Vulnerability
IJ04040 135857 Class Libraries FIX SECURITY VULNERABILITY CVE-2018-2641 4 20 Security Vulnerability
IJ04042 135845 Class Libraries FIX SECURITY VULNERABILITY CVE-2018-2657 4 20 Security Vulnerability
IJ04051 135804 Class Libraries FIX SECURITY VULNERABILITY CVE-2018-2663 4 20 Security Vulnerability
IJ04047 136171 Class Libraries FIX SECURITY VULNERABILITY CVE-2018-2677 4 20 Security Vulnerability
IJ04046 136164 Class Libraries FIX SECURITY VULNERABILITY CVE-2018-2678 4 20 Security Vulnerability
IJ03185 136613 Class Libraries INCORRECT BYTE OUTPUT WITH ISO2022JP CHARSET ENCODER 4 20
IJ04310 136601 Class Libraries JCL UPGRADE TO ORACLE LEVEL 7U171-B11 4 20
IJ04281 136071 Class Libraries STARTUP TIME INCREASE AFTER APPLYING APAR IV96905 4 20 Performance
IJ03822 136820 Class Libraries UPDATE TIMEZONE INFORMATION TO TZDATA2017C 4 20
IJ00268 135097 Java Virtual Machine CRASH IN LIBJ9JVMTI29.SO 4 20 Crash
IJ04039 135842 Java Virtual Machine FIX SECURITY VULNERABILITY CVE-2018-2582 4 20 Security Vulnerability
IJ03605 136636 Java Virtual Machine LEGACY SECURITY FOR COM.IBM.JVM.DUMP, TRACE, LOG WAS NOT ENABLED BY DEFAULT 4 20
IV89242 118075 Java Virtual Machine PROBLEMS WITH ALLOCATING HUGE OBJECTS 4 20 Crash
IJ02284 135609 JIT Compiler DIVISION BY ZERO IN JIT COMPILER 4 20 Crash
IJ04021 136838 JIT Compiler FIX SECURITY VULNERABILITY CVE-2018-1417 4 20 Security Vulnerability
IV82799 106819 JIT Compiler FLOATING POINT ERROR IN JIT COMPILER 4 20 Crash
IV88941 116137 JIT Compiler JIT COMPILER TAKES FAR TOO LONG TO COMPILE A METHOD 4 20 Hang
IJ03607 136313 JIT Compiler RESULT STRING CONTAINS A REDUNDANT DOT WHEN CONVERTED FROM BIGDECIMAL WITH 0 ON ALL PLATFORMS 4 20 Unexpected Behaviour
IX90185 136549 ORB UPGRADE IBMCFW.JAR TO VERSION O1800.01 4 20
IJ05598 136450 Security ADDED TLS SESSION HASH AND EXTENDED MASTER SECRET EXTENSION SUPPORT 4 20
IJ03800 136915 Security A FIX IN CMS PROVIDER FOR KDB INTEGRITY 4 20
IJ04282 136032 Security CHANGE IN LOCATION AND DEFAULT OF JURISDICTION POLICY FILES 4 20
IJ04053 135828 Security FIX SECURITY VULNERABILITY CVE-2018-2579 4 20 Security Vulnerability
IJ04052 135835 Security FIX SECURITY VULNERABILITY CVE-2018-2588 4 20 Security Vulnerability
IJ04043 135864 Security FIX SECURITY VULNERABILITY CVE-2018-2603 4 20 Security Vulnerability
IJ04283 130932 Security FIX SECURITY VULNERABILITY CVE-2018-2603 4 20 Security Vulnerability
IJ04041 135871 Security FIX SECURITY VULNERABILITY CVE-2018-2618 4 20 Security Vulnerability
IJ04036 135783 Security FIX SECURITY VULNERABILITY CVE-2018-2633 4 20 Security Vulnerability
IJ03853 136379 Security IBMCAC PROVIDER DOES NOT SUPPORT SHA224 4 20 Unexpected Behaviour
IJ02679 136741 Security IBMPKCS11IMPL – BAD SESSIONS ARE BEING ALLOCATED INTERNALLY 4 20 Unexpected Behaviour
IJ02706 136410 Security IBMPKCS11IMPL – BAD SESSIONS ARE BEING ALLOCATED INTERNALLY 4 20
IJ03552 136606 Security IBMPKCS11IMPL CONFIG FILE PROBLEM WITH THE SLOT SPECIFICATION ATTRIBUTE 4 20 Unexpected Behaviour
IJ01901 136076 Security IBMPKCS11IMPL – SECURERANDOM.SETSEED( ) EXCEPTION 4 20
IJ03801 136909 Security ISSUE WITH SAME DN CERTS, IKEYMAN GUI ERROR WITH STASH, JKS CHAIN ISSUE AND JVM ARGUMENT PARSE ISSUE WITH IKEYMAN 4 20
IJ03256 136554 Security JAVAX.SECURITY.AUTH.SUBJ ECT.TOSTRING() THROWS NPE 4 20 Functional Issue
PI93233 136573 z/OS Extentions CIPHER.DOFINAL() FAILS WHEN USING AES/GCM/NOPADDING WITH AAD DATA OF 13 BYTES AND A BLOCK SIZE OF 4081 TO 4096. 4 20 Exception Thrown

7.1 Service Refresh 4 Fix Pack 15

APAR Defect Component Oracle Bug ID Abstract SR FP Defect Type
Defect Fixes
IJ01216 134432 Class Libraries FIX SECURITY VULNERABILITY CVE-2016-10165 4 15 Security Vulnerability
IJ01223 135642 Class Libraries FIX SECURITY VULNERABILITY CVE-2017-10281 4 15 Security Vulnerability
IJ01212 134400 Class Libraries FIX SECURITY VULNERABILITY CVE-2017-10285 4 15 Security Vulnerability
IJ01224 134476 Class Libraries FIX SECURITY VULNERABILITY CVE-2017-10295 4 15 Security Vulnerability
IJ01221 134460 Class Libraries FIX SECURITY VULNERABILITY CVE-2017-10347 4 15 Security Vulnerability
IJ01219 134448 Class Libraries FIX SECURITY VULNERABILITY CVE-2017-10348 4 15 Security Vulnerability
IJ01222 134466 Class Libraries FIX SECURITY VULNERABILITY CVE-2017-10350 4 15 Security Vulnerability
IJ01217 134436 Class Libraries FIX SECURITY VULNERABILITY CVE-2017-10355 4 15 Security Vulnerability
IJ01218 134442 Class Libraries FIX SECURITY VULNERABILITY CVE-2017-10357 4 15 Security Vulnerability
IJ00616 135322 Class Libraries Incorrect replacement character for SHIFT_JIS converter after applying APAR IV53873 4 15 Functional Issue
IV99686 134827 Class Libraries JAVA.IO.FILE.LASTMODIFIE D() DOES NOT PROVIDE MILLISECOND PRECISION ON UNIX PLATFORMS 4 15 Unexpected Behaviour
IV96905 128485 Class Libraries SIGSEGV IN _MUTEX_LOCK WHILE DOING BLOCKING SOCKET OPERATION 4 15 Crash
IJ01211 134394 Java Virtual Machine FIX SECURITY VULNERABILITY CVE-2017-10346 4 15 Security Vulnerability
IV99768 126885 Java Virtual Machine GC ASSERTION IN MM_PARALLELTASK OR MM_PARALLELSCAVENGETASK AFTER SCAVENGER BACKOUT 4 15 Crash
IV98694 134010 JIT Compiler INCORRECT Z14 PROCESSOR INFORMATION REPORTED IN LOG 4 15 Usability
IV99782 133105 JIT Compiler INVOCATIONTARGETEXCEPTION IN JSR 292 CODE 4 15 Exception Thrown
IV99693 134069 JIT Compiler JAVA JIT COMPILER CRASH IN OSR PROCESSING DURING INLINING 4 15 Crash
IV98625 133997 Security CONNECTION RESET DURING TLS HANDSHAKE 4 15
IJ01225 135312 Security FIX SECURITY VULNERABILITY CVE-2017-10345 4 15 Security Vulnerability
IJ01215 134420 Security FIX SECURITY VULNERABILITY CVE-2017-10356 4 15 Security Vulnerability
IJ01213 134406 Security FIX SECURITY VULNERABILITY CVE-2017-10388 4 15 Security Vulnerability
IJ01501 135736 Security KEYTOOL HELP INFORMATION FOR -CERTREQ, -SELFCERT AND -GENCRL COMMANDS ARE INCORRECT. 4 15 Usability
IJ01050 135630 Security KEYTOOL NOT READING THE -DNAME PARAMETER WHILE CREATING A CSR 4 15 Unexpected Behaviour
IJ00684 135339 Security KRB5 SETCHANNELBINDING() FAILS WITH NULL INITIATORADDRESS AND ACCEPTORADDRESS. 4 15
IV98628 133821 Security NULLPOINTEREXCEPTION PERFORMING SSL HANDSHAKE USING CHROME BROWSER 4 15 Exception Thrown
IJ00960 135524 Security SUBSEQUENT HANDSHAKES WORK AFTER ONE WORKING HANDSHAKE 4 15
IJ01220 134454 XML FIX SECURITY VULNERABILITY CVE-2017-10349 4 15 Security Vulnerability
PI86124 134386 z/OS Extentions ZFILE.OBTAINDSN MEMORY LEAKS 4 15 Out of Memory
PI87284 134999 z/OS Extentions ZUTIL.SUBSTITUTESYSTEMSY MBOLS MEMORY LEAKS 4 15 Out of Memory

7.1 Service Refresh 4 Fix Pack 10

APAR Defect Component Oracle Bug ID Abstract SR FP Defect Type
Defect Fixes
IV98581 130914 Class Libraries FIX SECURITY VULNERABILITY CVE-2017-10053 4 10 Security Vulnerability
IV98574 130884 Class Libraries FIX SECURITY VULNERABILITY CVE-2017-10067 4 10 Security Vulnerability
IV98568 130840 Class Libraries FIX SECURITY VULNERABILITY CVE-2017-10087 4 10 Security Vulnerability
IV98567 130834 Class Libraries FIX SECURITY VULNERABILITY CVE-2017-10089 4 10 Security Vulnerability
IV98632 130830 Class Libraries FIX SECURITY VULNERABILITY CVE-2017-10090 4 10 Security Vulnerability
IV98569 130846 Class Libraries FIX SECURITY VULNERABILITY CVE-2017-10102 4 10 Security Vulnerability
IV98584 130920 Class Libraries FIX SECURITY VULNERABILITY CVE-2017-10105 4 10 Security Vulnerability
IV98564 130812 Class Libraries FIX SECURITY VULNERABILITY CVE-2017-10107 4 10 Security Vulnerability
IV98579 130908 Class Libraries FIX SECURITY VULNERABILITY CVE-2017-10108 4 10 Security Vulnerability
IV98576 130902 Class Libraries FIX SECURITY VULNERABILITY CVE-2017-10109 4 10 Security Vulnerability
IV98563 130806 Class Libraries FIX SECURITY VULNERABILITY CVE-2017-10110 4 10 Security Vulnerability
IV98572 130852 Class Libraries FIX SECURITY VULNERABILITY CVE-2017-10116 4 10 Security Vulnerability
IV98575 133574 Class Libraries FIX SECURITY VULNERABILITY CVE-2017-10125 4 10 Security Vulnerability
IV98639 133348 Class Libraries FIX SECURITY VULNERABILITY CVE-2017-10243 4 10 Security Vulnerability
IV97359 126849 Class Libraries FSTATX FAILED WITH ERRNO=9 WHEN LAUNCH JAVA PROCESS WITH PROCESSBUILDER IF CALL PROCESSBUILDER.INHERITIO () ON IBM I 4 10
IV98401 133218 Class Libraries JAVA.NET.URLCLASSLOADER. CLOSE() METHOD DOESNOT RELEASE THE JAR FILES IT OPENED. 4 10 Functional Issue
IV98370 133217 Class Libraries PERFORMANCE DEGRADATION WHILE LOADING CLASSES USING JAVA.NET.URLCLASSLOADER AFTER MIGRATING TO IBM JDK 7 AND ABOVE 4 10 Performance
IV98663 130662 Class Libraries TRANSLATION MESSAGES UPDATE FOR DEPLOY 4 10
IV98664 130656 Class Libraries TRANSLATION MESSAGES UPDATE FOR JDK 4 10
IV98559 131216 Java Virtual Machine FIX SECURITY VULNERABILITY CVE-2017-1376 4 10 Security Vulnerability
IV97851 132760 Java Virtual Machine VERIFIER INCORRECTLY REJECTED USES OF UNINITIALIZED OBJECTS IN ‘IFNONNULL’ BYTECODES 4 10
IV98235 133296 JIT Compiler FLOATING POINT ERROR IN JIT COMPILER 4 10 Crash
IV97537 126879 JIT Compiler INVALID CODE GENERATED WHEN PERFORMING UNSAFE.COPYMEMORY 4 10 Crash
IV98001 133077 JIT Compiler JAVA JIT COMPILER CRASH 4 10 Functional Issue
IV97890 129373 JIT Compiler JIT COMPILER PROBLEM HANDLING EMPTY CONTROL FLOW BLOCK 4 10 Crash
IV97950 122039 JIT Compiler JVM CRASHES IN METHODHANDLE IMPLEMENTATION 4 10 Crash
IV98000 131685 Security DELIVERED FOR IBMCMSPROVIDER VERSION 2.59 4 10
IV98107 133646 Security DELIVER UPDATED IBMPKCS11IMPL NATIVE LIBRARIES 4 10
IV98105 133207 Security DELIVER UPDATED IBMPKCS11IMPL NATIVE LIBRARIES 4 10
IV98573 130878 Security FIX SECURITY VULNERABILITY CVE-2017-10115 4 10 Security Vulnerability
IV96924 132702 Security IBMPKCS11IMPL CRYPTO PROVIDER – EC PUBLIC KEY ENCODING 4 10
IV98106 133184 Security IBMPKCS11IMPL UPDATE TO ECDH KEY AGREEMENT, AND THE ADDITION OF NEW SUPPORT FOR THE RSA//OAEP CIPHER 4 10
IV98150 133621 Security IBMPKCS11IMPL UPDATE TO ECDH KEY AGREEMENT, AND THE ADDITION OF NEW SUPPORT FOR THE RSA//OAEP CIPHER 4 10
IV97947 133586 Security KEYCERTMGMT PKCMPEVENTFORMATTER.JAVA HAS A HARDCODED PASSWORD 4 10
IV96508 130588 Security KLIST DOES NOT PRINT THE CORRECT KEY VALUE 4 10
IV96797 131671 Security MULTIPLE PRIVATE KEYS FOR THE SAME PKCS#11 CERTIFICATE OBJECT ON THE TOKEN 4 10
IV96849 131329 Security X500UNIQUEIDENTIFIER IN CSR SUBJECT DOES NOT HAVE THE PROPER TYPE 4 10
IV98566 130824 XML FIX SECURITY VULNERABILITY CVE-2017-10096 4 10 Security Vulnerability
IV98565 130818 XML FIX SECURITY VULNERABILITY CVE-2017-10101 4 10 Security Vulnerability
PI84229 133488 z/OS Extentions IBMJCEHYBRID EXCEPTION – METHOD IS NOT SUPPORTED IN GCM MODE 4 10 Functional Issue
PI82212 130557 z/OS Extentions RACF PASSTICKETS IN Z/OS JAAS FAIL WHEN USED WITH JAASLOGINMODULE AND OS390LOGINMODULE 4 10 Documentation

7.1 Service Refresh 4 Fix Pack 5

APAR Defect Component Oracle Bug ID Abstract SR FP Defect Type
New Features/Enhancements
IV95310 123795 Security ADD JDK.TLS.LEGACYALGORITHMS FUNCTIONALITY TO 6.X AND 7.X 4 5
Defect Fixes
IV93544 124429 Class Libraries ‘JAVA.UTIL.TIMEZONE.GETD ISPLAYNAME() DISPLAYS INCORRECT TIMEZONE NAME FOR TURKEY 4 5
IV91092 124121 Class Libraries ABEND0C4 IN STRLEN CALLED FROM JAVA_SUN_NIO_FS_UNIXNATI VEDISPATCHER_STRERROR 4 5 Crash
IV93043 123783 Class Libraries CRASH IN GETNUMBUTTONS AFTER APPLYING LINUX OS PATCH ‘ LIBXI6-1.7.4-12.2.X86_64’ 4 5 Crash
IV95268 123751 Class Libraries FIX SECURITY VULNERABILITIES CVE-2016-9840, CVE-2016-9841, CVE-2016-9842 and CVE-2016-9843 4 5 Security Vulnerability
IV95264 124715 Class Libraries FIX SECURITY VULNERABILITY CVE-2017-3509 4 5 Security Vulnerability
IV95263 124705 Class Libraries FIX SECURITY VULNERABILITY CVE-2017-3511 4 5 Security Vulnerability
IV95262 124701 Class Libraries FIX SECURITY VULNERABILITY CVE-2017-3512 4 5 Security Vulnerability
IV95261 124695 Class Libraries FIX SECURITY VULNERABILITY CVE-2017-3514 4 5 Security Vulnerability
IV95266 125037 Class Libraries FIX SECURITY VULNERABILITY CVE-2017-3533 4 5 Security Vulnerability
IV95267 124721 Class Libraries FIX SECURITY VULNERABILITY CVE-2017-3539 4 5 Security Vulnerability
IV95265 125031 Class Libraries FIX SECURITY VULNERABILITY CVE-2017-3544 4 5 Security Vulnerability
IV95331 125909 Class Libraries HEALTHCENTER AGENT FAILS TO START WITH -XHEALTHCENTER JAVA COMMAND LINE OPTION 4 5 Exception Thrown
IV94294 125457 Class Libraries INCREASE IN NUMBER OF SYSTEM.GC() CALLS AT CERTAIN WORKLOADS AFTER APPLYING IV68743 4 5 Performance
IV94413 125123 Class Libraries java.nio.file.Path.toUri () returns garbage on z/OS after applying APAR IV77988 4 5 Unexpected Behaviour
IV93395 124277 Class Libraries JAVA.UTIL.TIMEZONE.GETDI SPLAYNAME() DISPLAYS INCORRECT TIMEZONE NAMES IN GERMAN LOCALE 4 5
IV93825 124524 Class Libraries MISSING DIGICERT GLOBAL ROOT G2 (GLOBALROOTCAG2) CERTIFICATE IN CACERTS 4 5
IV95071 125780 Class Libraries ORACLE JCL UPGRADE TO LEVEL 7U141-B11 4 5
IV93628 124393 Class Libraries UNABLE TO REMOVE WEBSERVICE APPLICATION FROM THE SERVER AFTERWSDL GENERATION 4 5 Performance
IV94682 123549 JIT Compiler ASSERTION OR CRASH DURING GARBAGE COLLECTION 4 5 Crash
IV95402 125768 JIT Compiler DAA OPTIMIZATION IS NOT TURNED OFF UNDER -XRS 4 5 Unexpected Behaviour
IV86617 114741 JIT Compiler HIGH-CPU HANG RUNNING JAVA CODE 4 5 Hang
IV93536 124359 JIT Compiler JAVA JIT: CRASH WHEN USING THE BALANCED GC POLICY ON POWER CPUS 4 5 Crash
IV95067 124974 JIT Compiler JAVA JIT COMPILER CRASHES UNDER FULL SPEED DEBUG OR HOT CODE REPLACE 4 5 Crash
IV92568 123342 JIT Compiler JAVA JIT -CRASH WHILE USING AOT AND THE BALANCED GC POLICY AFTER CHANGING -XMX 4 5 Crash
IV95073 125556 JIT Compiler JIT COMPILED TRAP INSTRUCTIONS CAUSE PROBLEMS ON ZOS 4 5 Performance
IX90183 125528 ORB ACCESSCONTROLEXCEPTION THROWN FROM SUNSERIALIZABLEFACTORY$1 .RUN 4 5
IV92797 121335 Reliability and Serviceability DTFJ MAY IMPROPERLY REPORT THE SIZE OF LARGE ARRAYS WHEN USING THE BALANCED GC POLICY. 4 5
IV95153 124387 Security BIN/IKEYCMD SCRIPT DOESN’T PRESERVE SHELL TOKENIZATION 4 5
IV93419 124306 Security DELIVERED FOR IBMCMSPROVIDER VERSION 2.58 4 5
IV94941 124449 Security IBMJCECCA ILLEGALSTATEEXCEPTION – METHOD IS NOT SUPPORTED IN GCM MODE 4 5 Exception Thrown
IV94625 125818 Security IKEYMAN/IBMJCE GENERATED ECC KEYS DO NOT WORK WITH GSKIT 4 5 Functional Issue
IV94326 125563 Security ISSUES WITH STRICT DER ENCODING CHECKS 4 5 Exception Thrown
IV93691 124608 Security JSSE THROWS KEY IS NOT AN RSAPRIVATEKEY WHILE USING FIPS & CAC 4 5
IV93878 124906 Security KLIST ERROR READING KEYTAB ENTRIES CONTAINING EXTENDED VERSION DATA. 4 5
IV93420 124300 Security NEW LOCALE OPTION, CERTIFICATE CHAIN ISSUE WITH JKS KEYSTORE, CA CERT DELETION ISSUE 4 5
IV95074 126869 Security RELAX DER PARSER CHECKS 4 5 Exception Thrown
IV93534 123520 Security XML DIGITAL SIGNATURE TESTS FAILING WITH SIGNATUREEXCEPTION 4 5 Exception Thrown
IV94577 125439 XML DATABUFFERHELPER.COMPUTE COORDS THROWS AN ARRAYINDEXOUTOFBOUNDSEXC EPTION 4 5 Exception Thrown
PI76235 123598 z/OS Extentions JSSE BAD_RECORD_MAC ERROR WHEN CONFIGURED WITH IBMJCECCA 4 5 Functional Issue

7.1 Service Refresh 4 Fix Pack 1

APAR Defect Component Oracle Bug ID Abstract SR FP Defect Type
Defect Fixes
IV91410 121897 Class Libraries JAVA.IO.IOEXCEPTION FROM JAVA.IO.FILE.GETCANONICA LPATH() 4 1 Unexpected Behaviour
IX90179 123774 ORB PERFORMANCE REGRESSION IN ORB WHEN JAVA SECURITY MANAGER IS ENABLED. 4 1

7.1 Service Refresh 4

APAR Defect Component Oracle Bug ID Abstract SR FP Defect Type
New Features/Enhancements
IV91307 121599 Class Libraries ORACLE DEPLOY UPGRADE TO LEVEL 7U131-B10 4
IV92985 122329 Class Libraries ORACLE DEPLOY UPGRADE TO LEVEL 7U131-B12 4
IV91506 121549 Class Libraries ORACLE JCL UPGRADE TO LEVEL 7U131-B10 4
IV92983 122496 Class Libraries ORACLE JCL UPGRADE TO LEVEL 7U131-B12 4
IV92141 122793 Class Libraries UPDATE TIMEZONE INFORMATION TO TZDATA2016J 4
IV90829 120883 Security SUPPORT JDK.TLS.CLIENT.PROTOCOLS SYSTEM PROPERTY ON JAVA 6 AND 7 4
Defect Fixes
IV92487 121824 Class Libraries FIX SECURITY VULNERABILITY CVE-2016-5552 4 Security Vulnerability
IV92489 120303 Class Libraries FIX SECURITY VULNERABILITY CVE-2017-3231 4 Security Vulnerability
IV92482 120309 Class Libraries FIX SECURITY VULNERABILITY CVE-2017-3241 4 Security Vulnerability
IV92483 120269 Class Libraries FIX SECURITY VULNERABILITY CVE-2017-3253 4 Security Vulnerability
IV92490 120285 Class Libraries FIX SECURITY VULNERABILITY CVE-2017-3259 4 Security Vulnerability
IV92488 120291 Class Libraries FIX SECURITY VULNERABILITY CVE-2017-3261 4 Security Vulnerability
IV92481 120297 Class Libraries FIX SECURITY VULNERABILITY CVE-2017-3272 4 Security Vulnerability
IV91073 120370 Class Libraries IKEYCMD IGNORES CUSTOM SECURITY PROPERTIES FILE PASSED USING -DJAVA.SECURITY.PROPERTI ES AFTER APPLYING APAR IV90162 4
IV91526 121891 Class Libraries POTENTIAL FILE DESCRIPTOR LEAK WHEN DEREGISTRATING AT AROUND THE SAME TIME AS AN ASYNC CLOSE 4
IV93288 124144 Class Libraries REFIX APAR IV93010 TO ADDRESS CVE-2016-2183 4 Security Vulnerability
IV92186 122867 Java Virtual Machine EXPECTED RAS DUMPS DO NOT OCCUR OR DO NOT OBEY THE REQUESTED -XDUMP PARAMETERS 4 Unexpected Behaviour
IV92480 120689 Java Virtual Machine FIX SECURITY VULNERABILITY CVE-2017-3289 4 Security Vulnerability
IV91703 121281 Java Virtual Machine JVM CALL TO CSRSI INTRODUCED UNWANTED SECURITY CHECKS ON Z/OS 4
IV89973 117760 Java Virtual Machine POSSIBLE ASSERTION IN GC WHEN NUMBER OF SLAVE THREADS ARE DYNAMICALLY REDUCED 4 Crash
IV92360 121447 JIT Compiler BYTE ARRAY COPY TERMINATES UNEXPECTEDLY 4 Unexpected Behaviour
IV90913 120899 JIT Compiler CRASH IN GC, VM, OR JIT COMPILED METHODS CONTAINING OBJECT ALLOCATION ON POWER PLATFORMS 4
IV91077 112665 JIT Compiler CRASH IN JIT COMPILATION 4 Functional Issue
IV91347 121399 JIT Compiler HANG DUE TO VALUEPROFILINGMUTEX LOCK NOT BEING RELREASED 4 Hang
IV90684 119581 JIT Compiler INCORRECT RESULT FROM LOGICAL AND OF TWO LONGS 4 Exception Thrown
IV91275 120998 JIT Compiler INCORRECT RESULTS CONVERTING BYTE TO CHAR ARRAY 4 Functional Issue
IV93007 119065 JIT Compiler JAVA EXCEPTION HANDLER RECEIVES INCORRECT EXCEPTION REFERENCE 4 Crash
IV91507 122016 JIT Compiler JAVA JIT – DEADLOCK WITH A JAVA OBJECT MONITOR 4 Hang
IV91276 120878 JIT Compiler JIT COMPILER CRASHES DURING COMPILATION 4 Crash
IX90177 120648 ORB JAVA.LANG.CLASSCASTEXCEP TION IN ORB 4 Unexpected Behaviour
IX90178 123247 ORB THIN CLIENT FAILING WITH: JAVAX.NAMING.NAMINGEXCEP TION 4
IV90912 120051 Security CRL DISTRIBUTION POINT CONNECTION TIMEOUT 4
IV90630 120467 Security DEFECT IN IBMCMSPROVIDER 2.0 BLD 56 4
IV93010 117674 Security FIX SECURITY VULNERABILITY CVE-2016-2183 4 Security Vulnerability
IV92898 120695 Security FIX SECURITY VULNERABILITY CVE-2016-5546 4 Security Vulnerability
IV92486 120713 Security FIX SECURITY VULNERABILITY CVE-2016-5547 4 Security Vulnerability
IV92484 120701 Security FIX SECURITY VULNERABILITY CVE-2016-5548 4 Security Vulnerability
IV93009 120707 Security FIX SECURITY VULNERABILITY CVE-2016-5549 4 Security Vulnerability
IV92485 120263 Security FIX SECURITY VULNERABILITY CVE-2017-3252 4 Security Vulnerability
IV92273 122884 Security KEYMANAGERFACTORY RELATED SYNCHRONIZATION ISSUE WHEN TRYING TO OPEN DIFFERENT KEYSTORES 4 Exception Thrown
IV90578 120520 Security NEW REQUIREMENT FOR IKEYMAN ADD/RECEIVE COMMAND, FIX A REGRESSION IN PKCS12/JKS KEYSTORE 4 Exception Thrown

7.1 Service Refresh 3 Fix Pack 60

Technote for this SR/FP

APAR Defect Component Oracle Bug ID Abstract SR FP Defect Type
New Features/Enhancements
IV89456 118072 Class Libraries ORACLE DEPLOY UPGRADE TO LEVEL 7U121-B12 3 60
IV89771 119017 Class Libraries ORACLE DEPLOY UPGRADE TO LEVEL 7U121-B15 3 60
IV89454 117767 Class Libraries ORACLE JCL UPGRADE TO LEVEL 7U121-B12 3 60
IV89600 118578 Class Libraries ORACLE JCL UPGRADE TO LEVEL 7U121-B13 3 60
IV89774 118977 Class Libraries ORACLE JCL UPGRADE TO LEVEL 7U121-B15 3 60
IV89827 119073 Class Libraries UPDATE TIMEZONE INFORMATION TO TZDATA2016G 3 60 Functional Issue
Defect Fixes
IV86398 114771 Class Libraries CRASH IN SUN/AWT/IMAGE/JPEGIMAGED ECODER.READIMAGE 3 60 Crash
IV90162 116663 Class Libraries FIX SECURITY VULNERABILITY CVE-2016-5542 3 60 Security Vulnerability
IV90161 116651 Class Libraries FIX SECURITY VULNERABILITY CVE-2016-5554 3 60 Security Vulnerability
IV90158 116627 Class Libraries FIX SECURITY VULNERABILITY CVE-2016-5556 3 60 Security Vulnerability
IV90157 116621 Class Libraries FIX SECURITY VULNERABILITY CVE-2016-5568 3 60 Security Vulnerability
IV90159 116639 Class Libraries FIX SECURITY VULNERABILITY CVE-2016-5573 3 60 Security Vulnerability
IV90160 116645 Class Libraries FIX SECURITY VULNERABILITY CVE-2016-5597 3 60 Security Vulnerability
IV88896 117491 Class Libraries JAVA.BEANS.INTROSPECTOR THROWS JAVA.LANG.NULLPOINTEREXC EPTION AFTER APPLYING APAR IV80133 3 60 Exception Thrown
IV87868 116506 Class Libraries JAVA.NET.URL.GETPORT() RETURNS DEFAULT AS 0 INSTEAD OF -1 AFTER APPLYING APAR IV79351 3 60
IV88924 116469 Class Libraries JAVA WITH HPROF AGENT ABENDS WITH U4083 ON Z/OS AFTER APPLYING IV38146 3 60
IV87415 116054 Class Libraries THE “LINE.SEPARATOR” PROPERTY IS NOT HONORED WHEN SET PROGRAMMATICALLY AFTER APPLYING IV87263 3 60 Unexpected Behaviour
IV89126 117105 Java Virtual Machine 64-BIT JDKS ON LINUX AND AIX SHOULD ADD /USR/LIB64 TO JAVA.LIBRARY.PATH AHEAD OF /USR/LIB 3 60 Exception Thrown
IV88882 117093 Java Virtual Machine ASSERTION FROM ROMCLASSBUILDER WHEN USING OPTION XCHECK:VM:DEBUGINFO 3 60
IV87320 115660 Java Virtual Machine ENABLE VM TO PARSE A 2G OR LARGER PAGE SIZE ON LINUX 3 60 Functional Issue
IV87037 115374 Java Virtual Machine GC CRASH WHEN CONCURRENT GC WORK PACKET OVERFLOW 3 60 Crash
IV88646 116823 Java Virtual Machine JVM CRASHES WHEN TRYING TO PRINT A STACK TRACE 3 60 Crash
IV86915 115245 JIT Compiler DIVISION BY ZERO ERROR DURING INLINING 3 60 Crash
IV88620 117095 JIT Compiler JAVA 7 MULTI-TYPE EXCEPTION CATCH FAILS TO EXECUTE THE FINALLY BLOCK 3 60 Functional Issue
IV90105 104492 JIT Compiler JAVA IMPROPERLY REUSES STACK LOCATION 3 60 Exception Thrown
IV87105 115653 JIT Compiler JAVA JIT PPC: CRASH EXECUTING BIGDECIMAL DFP OPERATIONS 3 60 Crash
IX90175 115488 ORB ORG.OMG.CORBA.COMM_FAILU RE 3 60 Usability
IV87773 116484 Security JAVA.LANG.ARRAYINDEXOUTO FBOUNDSEXCEPTION WITH AES/GCM CIPHER 3 60
IV87869 116494 Security JAVA 7 JAVASECURITYAUTHKERBEROS ACCESSIMPL FAILING ON SOLARIS 3 60 Exception Thrown
IV89825 118886 Security MISMATCH IN RECORDID AND MORE SECURED STASH FILE FORMAT 3 60
IV87355 116091 Security NULLPOINTEREXCEPTION WHILE CALLING GSSNAME.GETSTRINGNAMETYP E() 3 60 Exception Thrown
IV89826 118880 Security PFX/PKCS12 IMPORT FAILURE, AN UNSOLVED ISSUE WITH DUPLICATE PUBLIC KEY, SECURED STASH FILE AND EXCEPTION WHILE SORTING 3 60
IV89071 117733 Security PKCS12 KEYSTORE NOSUCHALGORITHMEXCEPTION DURING PKCS12KEYSTOREORACLE.ENG INELOAD 3 60 Exception Thrown
IV87459 116154 Security SSLSOCKETFD.GETFD() THROWS UNEXPECTED EXCEPTION 3 60 Exception Thrown
PI66418 116911 z/OS Extentions TLSV1.2 ERRORS WHEN USING IBMJCEHYBRID PROVIDER 3 60

7.1 Service Refresh 3 Fix Pack 50

Technote for this SR/FP

APAR Defect Component Oracle Bug ID Abstract SR FP Defect Type
New Features/Enhancements
IV85738 113904 Class Libraries ORACLE DEPLOY UPGRADE TO LEVEL 7U111-B09 3 50
IV86292 114687 Class Libraries ORACLE DEPLOY UPGRADE TO LEVEL 7U111-B13 3 50
IV86391 114486 Class Libraries ORACLE JCL UPGRADE TO LEVEL 7U111-B13 3 50
IV86190 113748 Class Libraries UPDATE JAVA LOGOS USED WITH IBM JDK 3 50
IV86563 114408 Class Libraries UPDATE TIMEZONE INFORMATION TO TZDATA2016E 3 50 Functional Issue
IV86399 114176 Security NEW FIPS 140-2 CERTIFIED IBMJCEFIPS PROVIDER VERSION 1.8 AND ITS CO-REQUISITE IBMJSSE2 PROVIDER 3 50 Usability
Defect Fixes
IV85452 112664 Class Libraries ARRAYINDEXOUTOFBOUNDSEXC EPTION IN JAVAX.SWING.TEXT.HTML.PA RSER.CONTENTMODEL.FIRST() 3 50 Exception Thrown
IV83756 110846 Class Libraries CRASH IN COM.SUN.IMAGEIO.PLUGINS. JPEG.JPEGIMAGEREADER.REA DIMAGE() 3 50 Crash
IV87083 112321 Class Libraries FIX SECURITY VULNERABILITY CVE-2016-3485 3 50 Security Vulnerability
IV87082 112287 Class Libraries FIX SECURITY VULNERABILITY CVE-2016-3511 3 50 Security Vulnerability
IV86616 112845 Class Libraries HANG IN CERTAIN SCENARIO WITH JAVA.NIO.CHANNELS.FILECH ANNEL.LOCK() AFTER APPLYING APAR IV78039 3 50
IV82947 109895 Class Libraries HTTP AUTHORIZATION HEADER IS NOT PROPERLY ENCODED IN ZOS 3 50 Exception Thrown
IV85897 113471 Class Libraries INTERFACE FOR CLASS VALIDATION DURING DE-SERIALIZATION OF OBJECTS 3 50
IV85737 108497 Class Libraries JAVA.MATH.BIGINTEGER.TOB YTEARRAY() RETURNS INCORRECT BYTE OUTPUT 3 50 Unexpected Behaviour
IV87113 113396 Class Libraries JCK:JAVA80SR4 : SFJ : API/JAVA_NIO/CHARSET/CHA RSET/INDEX.HTML#METHODS: FAILS WITH JAVA.LANG.NOCLASSDEFFOUN DERROR 3 50 Exception Thrown
IV83450 110590 Class Libraries MAKING SECURERANDOM FIPS COMPLIANT 3 50 Unexpected Behaviour
IV85741 113819 Class Libraries ORACLE JCL UPGRADE TO LEVEL 7U111-B09 3 50
IV83633 110651 Class Libraries PERFORMANCE DEGRADATION WITH JAVA.IO.DATAOUTPUTSTREAM .WRITEINT() 3 50 Performance
IV85348 112441 Class Libraries THE PORT IS BUSY AFTER CALLING HTTPSERVER.STOP() 3 50
IV84625 112208 Class Libraries TRANSLATION MESSAGES UPDATE FOR JDK 3 50
IV83478 110582 Class Libraries UNABLE TO REMOVE WEBSERVICE APPLICATION FROM THE SERVER AFTER WSDL GENERATION 3 50 Functional Issue
IV85620 113371 Java Virtual Machine A KEY WAS INCORRECTLY REMOVED FROM A WEAKHASHMAP TABLE 3 50 Functional Issue
IV87081 112279 Java Virtual Machine FIX SECURITY VULNERABILITY CVE-2016-3598 3 50 Security Vulnerability
IV87982 62644 Java Virtual Machine GC ASSERTION DUE TO MISSING SYNCHRONIZATION POINT 3 50
IV82681 114356 Java Virtual Machine INCORRECT BEHAVIOUR OF MEMORYPOOLMXBEAN.ISCOLLE CTIONUSAGETHRESHOLDEXCEE DED() 3 50
IV85243 107857 Java Virtual Machine JAVA REPORTS INCORRECT OPERATING SYSTEM ON WINDOWS SERVER 2016 3 50
IV85004 109991 JIT Compiler A SEGMENTATION FAULT IS RAISED WHILE THE USER IS DEBUGGING JAVA CODE OR AN AGENT IS ATTACHED 3 50 Crash
IV84322 111087 JIT Compiler CRASH/ASSERT IN GC WITH BAD O-SLOT. 3 50 Crash
IV83976 111122 JIT Compiler CRASH IN JAVA_JAVA_LANG_INVOKE_MU TABLECALLSITE_INVALIDATE 3 50 Functional Issue
IV86709 105784 JIT Compiler INCORRECT LOOP TERMINATION IN JAVA 3 50
IV86710 110316 JIT Compiler INCORRECT VALUE READ FROM JAVA ARRAY ELEMENT 3 50
IV84283 111573 JIT Compiler JAVA JIT 7.1 – INCORRECT CASE IS USED FOR A SWITCH 3 50 Crash
IV85454 113461 JIT Compiler JAVA JIT – HEAP CORRUPTION DUE TO ARRAYCOPY OF UP TO 8 TIMES TOO MANY BYTES 3 50 Crash
IV85347 111834 JIT Compiler JIT COMPILER CRASHES OR HANGS DURING IDIOM TRANSFORMATION 3 50 Hang
IV86435 112824 JIT Compiler JIT INCORRECTLY OPTIMIZES LOCKS CAUSING GC ASSERT 3 50 Crash
IV86165 110347 JIT Compiler JIT OPTIMIZATION PRODUCES INCORRECT RETURN TYPE CAUSING A CRASH 3 50 Crash
IV86057 104623 JIT Compiler JVM CRASHES WHEN RUNNING JAVA/LANG/THROWABLE.PRIN TSTACKTRACE 3 50 Crash
IV86387 111075 JIT Compiler UNEXPECTED RESULT FROM INTEGER SHIFT BYTECODE 3 50 Hang
IX90174 115219 ORB JAVA.LANG.SECURITYEXCEPT ION: METHOD IS NOT SUPPORTED VIA THE PROXY 3 50
IX90173 111684 ORB SECURITYEXCEPTION 3 50
IV84909 112677 Security 1.TEST UTIMACO HSM 2.SHA256 FINGERPRINTS FOR CERTIFICATE 3.LOAD CMS PROVIDER VIA PROPERTIES 3 50
IV84169 111315 Security CANNOT LIST CMS KEYSTORE USING KEYTOOL 3 50 Exception Thrown
IV84284 111440 Security CANNOT LOAD PKCS12 KEYSTORE FILE IN JAVA 8 3 50 Exception Thrown
PI61756 112408 Security HWKEYTOOL -GENSECKEY -EXISTINGLABEL SOMETIMES REQUIRES (BUT DOESNOT ACCEPT) -KEYSIZE 3 50 Unexpected Behaviour
IV85106 112419 Security HWKEYTOOL -PRINTCERT IS MISSING A MESSAGE INSERT 3 50 Unexpected Behaviour
IV84093 111247 Security IBMPKCS11IMPL: NULL POINTER FROM SECRETKEY GETFORMAT() CAUSES NULLPOINTEREXCEPTION 3 50 Exception Thrown
IV83632 110739 Security IPV6 ADDRESS TYPE IS NOT CORRECT 3 50 Unexpected Behaviour
IV83715 110795 Security JAVA 8 FAILED TO PERFORM SSO WITH MICROSOFT SASL SERVER 3 50 Exception Thrown
IV84168 111316 Security NAMESPACE NODE NOT REMOVED DURING EXCLUSIVE CANONICALIZATION 3 50 Unexpected Behaviour
IV87148 114779 Security NULLPOINTEREXCEPTION IN HWKEYTOOL -GENSECKEY WITH PKCS11 KEYSTORE 3 50 Exception Thrown
IV85279 113195 Security SSLCONTEXT.GETINSTANCE BEHAVIOR LIKE ORACLE 3 50
IV84462 111896 XML INPUT TYPE STAXSOURCE CAUSES AN EXCEPTION WHEN PASSED TO AN IDENTITY TRANSFORMER EXECUTING IN INTERPRETED MODE. 3 50 Exception Thrown
PI65474 113673 z/OS Extentions UNWRAPPING A TR-31 BLOCK WITH NOCVKEK OPTION USING THE IBMJCECCA PROVIDER DOES NOT RETURN A NOCVKEK KEY 3 50 Unexpected Behaviour

7.1 Service Refresh 3 Fix Pack 40

Technote for this SR/FP

APAR Defect Component Oracle Bug ID Abstract SR FP Defect Type
New Features/Enhancements
IV81319 107293 Class Libraries ORACLE DEPLOY UPGRADE TO LEVEL 7U101-B06 3 40
IV82059 108300 Class Libraries ORACLE DEPLOY UPGRADE TO LEVEL 7U101-B08 3 40
IV84145 110002 Class Libraries ORACLE DEPLOY UPGRADE TO LEVEL 7U101-B13 3 40
IV81276 107277 Class Libraries ORACLE JCL UPGRADE TO LEVEL 7U101-B06 3 40
IV82058 108651 Class Libraries ORACLE JCL UPGRADE TO LEVEL 7U101-B09 3 40
IV82445 109121 Class Libraries ORACLE JCL UPGRADE TO LEVEL 7U101-B11 3 40
IV83131 109392 Class Libraries ORACLE JCL UPGRADE TO LEVEL JDK7U101-B11 3 40
IV83250 106995 Class Libraries UPDATE TIMEZONE INFORMATION TO TZDATA2016C 3 40
Defect Fixes
IV84703 112449 Consumability HIGH CPU USAGE WHEN USING LARGE NUMBERS OF JAVA VIRTUAL MACHINESS WITH HEALTH CENTER ENABLED 3 40 Performance
IV80522 106035 Class Libraries /META-INF/MIMETYPES.DEFA ULT MISSING IN JRE/LIB/RESOURCES.JAR IN IBM JDK1.7 3 40 Unexpected Behaviour
IV83103 109687 Class Libraries ADD IBM1047 CHARSET SUPPORT FOR SMALL FOOTPRINT JAVA 3 40 Functional Issue
IV80133 104885 Class Libraries BEAN INTROSPECTOR RESOLVES TYPE OF OVERRIDDEN PROPERTY INCORRECTLY 3 40
IV84026 107300 Class Libraries FIX SECURITY VULNERABILITY CVE-2016-0686 3 40 Security Vulnerability
IV84029 107312 Class Libraries FIX SECURITY VULNERABILITY CVE-2016-3422 3 40 Security Vulnerability
IV84027 107287 Class Libraries FIX SECURITY VULNERABILITY CVE-2016-3427 3 40 Security Vulnerability
IV83999 107281 Class Libraries FIX SECURITY VULNERABILITY CVE-2016-3443 3 40 Security Vulnerability
IV84028 107994 Class Libraries FIX SECURITY VULNERABILITY CVE-2016-3449 3 40 Security Vulnerability
IV75654 97372 Class Libraries SCHEMAGEN FAILS WITH STACKOVERFLOWERROR IF THE ATTRIBUTE OF THE CLASS HAS A REFERENCE TO THE SAME CLASS 3 40 Exception Thrown
IV80317 105982 Class Libraries UNSATISFIEDLINKERROR WITH JAVA.NIO.FILE.ATTRIBUTE. USERDEFINEDATTRIBUTEVIEW 3 40 Exception Thrown
IV77988 101718 Class Libraries WITH FILE ENCODING ISO8859-1 JAVA.NIO.FILE.FILES.WALK FILETREE FAILS WITH NOSUCHFILEEXCEPTION WHILE SCANNING THE FILE TREE. 3 40 Functional Issue
IV81193 104487 Java Virtual Machine FAIL WITH CANNOT LOAD MODULE LIBJVM.SO FILE 3 40 Unexpected Behaviour
IV82165 108677 Java Virtual Machine FILE PATHS AND SYSTEM PROPERTIES CONTAINING UNICODE ESCAPE SEQUENCES CORRUPTED 3 40 Unexpected Behaviour
IV84035 105123 Java Virtual Machine FIX SECURITY VULNERABILITY CVE-2016-0264 3 40 Security Vulnerability
IV82060 108033 Java Virtual Machine GPF DUE TO FAILURE TO CREATE SHARED CACHE WHEN RUNNING WITH THE -XSHARECLASSES:NONFATAL OPTION 3 40 Crash
IV82829 101228 Java Virtual Machine J9 ATTEMPTS CLASSLOADING FOR INSTANCEOF / CHECKCAST OF NULL OBJECTS 3 40 Standards Noncompliance
IV82515 109057 Java Virtual Machine JAVA THREAD LEAK WHEN USING THREAD-LOCAL STORAGE DESTRUCTORS TO DETACH NATIVE THREADS 3 40 Out of Memory
IV82716 109159 Java Virtual Machine METHODHANDLE FROM FINDSTATIC INCORRECT AFTER REDEFINE 3 40
IV76884 109160 Java Virtual Machine OVERLY RESTRICTED METHODHANDLE RETURNED FROMMETHODHANDLES$LOOKUP .UNREFLECT(), METHODHANDLES$LOOKUP.FIN DSPECIAL() AND METHODHANDL 3 40
IV81083 98873 JIT Compiler FAILURE TO UPDATE VARIABLE IN LOOP COPYING FROM BYTE ARRAY INTO CHARACTER ARRAY 3 40 Unexpected Behaviour
IV81926 106579 JIT Compiler FINAL FIELD OF STRING CREATED BY A STRINGBUILDER APPEARS INCORRECTLY INITIALIZED ON A WEAK MEMORY PLATFORM 3 40 Crash
IV84000 107294 JIT Compiler FIX SECURITY VULNERABILITY CVE-2016-0687 3 40 Security Vulnerability
IV82849 99191 JIT Compiler HANG DUE TO JIT COMPILATION THREAD OMITTING TO SEND A NOTIFICATION SIGNAL WHEN COMPILATION ENDS 3 40 Hang
IV81731 108402 JIT Compiler JAVA JIT: CRASH IN JIT COMPILED CODE 3 40 Crash
IV82902 109676 JIT Compiler JAVA JIT – INCORRECT COMPARISION RESULTS ON X86 CPUS 3 40 Crash
IV83043 102406 JIT Compiler JAVA JIT MARKS CERTAIN NATIVE POINTERS AS COLLECTED REFERENCES ON X86-32 3 40 Unexpected Behaviour
IV82901 107853 JIT Compiler JAVA SEGMENTATION ERROR WITH VMSTATE=0X00050AFF/0X000 51CFF 3 40 Crash
IV82678 108856 JIT Compiler NULLPOINTEREXCEPTION IN COM.IBM.JIT.DECIMALFORMA THELPER.FORMATASDOUBLE 3 40
IX90172 110529 ORB FIX SECURITY VULNERABILITY CVE-2016-0363 3 40 Security Vulnerability
IX90171 110878 ORB FIX SECURITY VULNERABILITY CVE-2016-0376 3 40 Security Vulnerability
IV80083 105166 Reliability and Serviceability JDMPVIEW COMMAND ‘INFO CLASS’ DOES NOT SHOW ALL CLASSES 3 40 Functional Issue
IV80929 106943 Service, Build, Packaging and Delivery UPDATE LICENSE TO ADD THE RESTRICTION WHILE USING IBM JDK WITH PERVASIVE DEVICES 3 40
IV82166 108931 Security CANNOT CORRECTLY READ CACHE FILE GENERATED WITH NON-IBM KINIT 3 40 Unexpected Behaviour
IV82443 108946 Security CANNOT INITIALIZE CIPHER CREATED WITH ALGORITHM OID 3 40 Exception Thrown
IV82025 108821 Security CANNOT LIST CACHE ENTRY WITH REALM-LESS SERVICE NAME 3 40 Exception Thrown
IV82715 109285 Security FAILED TO READ SYSTEM PROPERTY 3 40 Exception Thrown
IV84030 107330 Security FIX SECURITY VULNERABILITY CVE-2016-3426 3 40 Security Vulnerability
IV80403 106081 Security IKEYMAN ALLOWS CREATION OF DUPLICATE CERTIFICATE REQUEST AND DOES NOT VALIDATE/CREATE CERTIFICATE CHAIN CORRECTLY 3 40
IV81082 107257 Security JGSS’S CANONICALIZATION METHOD SHOULD ACCEPT STANDARD SPN 3 40 Usability
PI58684 108874 Security JRIO RecordFile.exists() may return incorrect value. Some of JRIO classes may throw unexpected exceptions. 3 40 Unexpected Behaviour
IV81929 105222 Security PERFORMANCE ISSUES WITH DIFFIE-HELLMAN KEYPAIRGENERATOR USING THE IBMJCE PROVIDER 3 40 Performance
IV80678 106573 Security PORT JCEFIPS 8.0 AES-GCM INTERNAL IV SUPPORT TO STANDARD JCE 3 40
IV81050 106795 Security STRENGTHEN HWKEYTOOL DEFAULT SIGNATURE ALGORITHM TO SHA256WITHRSA 3 40 Currency
IV81255 107585 XML NEW LINE FEED IS NOT PRESENT AFTER XML DECLARATION 3 40 Unexpected Behaviour

7.1 Service Refresh 3 Fix Pack 31

APAR Defect Component Oracle Bug ID Abstract SR FP Defect Type
Defect Fixes
IV81648 107227 Class Libraries FIX SECURITY VULNERABILITY CVE-2016-0603 3 31 Security Vulnerability

7.1 Service Refresh 3 Fix Pack 30

Technote for this SR/FP

APAR Defect Component Oracle Bug ID Abstract SR FP Defect Type
New Features/Enhancements
IV80531 105639 Class Libraries ORACLE CLASS LIBRARY UPGRADE TO LEVEL 7U95-B13 3 30
IV80529 105754 Class Libraries ORACLE CLASS LIBRARY UPGRADE TO LEVEL 7U95-B14 3 30
IV79322 104228 Class Libraries ORACLE DEPLOY UPGRADE TO LEVEL 7U95-B09 3 30
IV79881 105200 Class Libraries ORACLE DEPLOY UPGRADE TO LEVEL 7U95-B10 3 30
IV80530 105653 Class Libraries ORACLE DEPLOY UPGRADE TO LEVEL 7U95-B14 3 30
IV79354 104171 Class Libraries ORACLE JCL UPGRADE TO LEVEL 7U95-B09 3 30
IV79880 104959 Class Libraries ORACLE JCL UPGRADE TO LEVEL 7U95-B10 3 30
IV78712 102824 Security ADD SUPPORT FOR RFC5915 ENCODED EC PRIVATE KEYS 3 30 Functional Issue
Defect Fixes
IV80611 85370 Class Libraries FIX SECURITY VULNERABILITY CVE-2015-7981 AND CVE-2015-8540 3 30
IV80579 104129 Class Libraries FIX SECURITY VULNERABILITY CVE-2015-8126 and CVE-2015-8472 3 30 Security Vulnerability
IV80584 103561 Class Libraries FIX SECURITY VULNERABILITY CVE-2016-0402 3 30 Security Vulnerability
IV80585 103567 Class Libraries FIX SECURITY VULNERABILITY CVE-2016-0448 3 30 Security Vulnerability
IV80581 103523 Class Libraries FIX SECURITY VULNERABILITY CVE-2016-0483 3 30 Security Vulnerability
IV80580 103517 Class Libraries FIX SECURITY VULNERABILITY CVE-2016-0494 AND CVE-2015-8472 3 30 Security Vulnerability
IV78039 101607 Class Libraries IOEXCEPTION THROWN FROM JAVA.NIO.CHANNELS.FILECH ANNEL 3 30 Exception Thrown
IV77918 101479 Class Libraries JAVA.LANG.PROCESSBUILDER DOES NOT REDIRECT OUTPUT/ERROR MESSAGES TO FILES ON ZOS PLATFORM 3 30 Functional Issue
IV80575 102501 Class Libraries LIBUNPACK.SO AND LIBKCMS.SO ARE NOT ZAAP ENABLED 3 30
IV78787 103480 Class Libraries ORACLE BUG 8133523 – JAVA PLUGIN CAUSES FIREFOX CRASH ON WINDOWS 3 30 Crash
IV78195 101927 Class Libraries UNABLE TO REMOVE WEBSERVICE APPLICATION FROM THE SERVER CLUSTER WHILE RUNNING 3 30 Unexpected Behaviour
IV78314 102280 Class Libraries UNSATISFIEDLINKERROR THROWN IN JAVA.UTIL.ARRAYS.SORT() 3 30 Exception Thrown
IV78743 103279 Java Virtual Machine /DEV/KMEM SHOULD NOT BE KEPT OPEN OR USED BY JVM 3 30 Unexpected Behaviour
IV79565 104695 Java Virtual Machine CRASH DUE TO STALE JIT DATA 3 30 Crash
IV77156 99719 Java Virtual Machine DEADLOCK IN APPLICATIONS THAT USE METHOD THREADMXBEANIMPL.GETTHRE ADINFOIMPL() 3 30 Hang
IV76898 101893 Java Virtual Machine HEALTH CENTER VERSION 3.0 CREATES THREADS THAT ARE NOT ZAAP ENABLED 3 30 Functional Issue
IV79829 105110 Java Virtual Machine JAVA TRACEASSERT IN PARALLELSCAVENGER CODE OF GC WHILE DEBUGGING 3 30 Crash
IV79432 96852 Java Virtual Machine JVMTI FUNCTION GETBYTECODES INCORRECTLY RETURNS JVMTI_ERROR_INTERNAL WHEN THE METHOD HAS INVOKEDYNAMIC BYTECODE(S) 3 30
IV79923 104883 Java Virtual Machine METHODHANDLE IMPLEMENTATION CAUSES JVM TO HANG INTERMITTENTLY 3 30 Hang
IV79222 103332 Java Virtual Machine NULL POINTER EXCEPTION IN IBM.TOOLS.ATTACH.J9ATTAC HPROVIDER.LISTVIRTUALMAC HINES 3 30 Functional Issue
IV78991 105482 Java Virtual Machine PARTIALLY FILLED PAGES IN SHARED CLASS CACHE ARE NOT WRITE PROTECTED 3 30 Crash
IV79830 104987 Java Virtual Machine SEGMENTATION ERROR WHILE DEBUGGING JAVA CODE 3 30 Crash
IV78397 100512 Java Virtual Machine SIGNAL REPORTER THREAD IS SPAWNED WITH MEDIUM WEIGHT EVEN WHEN ‘JAVA_THREAD_MODEL=HEAVY’ 3 30 Functional Issue
IV78552 101402 Java Virtual Machine SOME IFA TRACEPOINTS ARE NOT HANDLED CORRECTLY 3 30 Unexpected Behaviour
IV80394 100820 JIT Compiler CRASH DURING JIT COMPILATION IN JAVA 8 ON 64-BIT BIG ENDIAN POWER LINUX 3 30 Crash
IV78392 101990 JIT Compiler CRASH IN JIT LIBRARY WITH DIVIDE BY ZERO 3 30 Crash
IV78631 102527 JIT Compiler CRASH IN LIBC GETENV DURING JIT COMPILATION 3 30 Crash
IV72872 83162 JIT Compiler FIX SECURITY VULNERABILITY CVE-2015-5041 3 30 Security Vulnerability
IV78828 99338 JIT Compiler HIGH CPU USAGE CAUSED BY EXCESSIVE JIT COMPILATION FAILURES 3 30 Performance
IV78633 101433 JIT Compiler JAVA HANG ON FULL GARBAGE COLLECTION 3 30
IV80392 101738 JIT Compiler JVM CRASHES DURING JIT COMPILATION 3 30 Crash
IV79118 103458 JIT Compiler JVM CRASHES WHILE EXECUTING TRANSACTIONAL MEMORY 3 30 Crash
IV79744 104800 JIT Compiler MEMORY LEAK UNDER THE -XSHARECLASSES OPTION 3 30 Out of Memory
IV80361 87865 JIT Compiler OUTOFMEMORYERROR FROM JIT COMPILED CODE AT LOW OPTIMIZATION LEVELS 3 30 Out of Memory
IV80397 104941 JIT Compiler SEGMENTATION ERROR ON ACCESSING OBJECT MOVED BY GC 3 30 Crash
IV80396 104481 JIT Compiler UNEXPECTED JAVA.LANG.NULLPOINTEREXC EPTION OCCURS ON A LINE WHERE SUCH AN EXCEPTION IS NOT POSSIBLE 3 30 Exception Thrown
IV79626 102541 Reliability and Serviceability JDMPVIEW ‘INFO THREAD’ COMMAND DOES NOT ALLOW TCB AS THREAD ID 3 30 Functional Issue
IV79709 103651 Reliability and Serviceability JVM TRACE ENGINE THREAD IS NOT IFA ENABLED 3 30 Unexpected Behaviour
IV79547 103121 Reliability and Serviceability NULLPOINTEREXCEPTION WHEN RUNNING JDMPVIEW !SNAPFORMAT OR !SNAPTRACE COMMANDS 3 30 Exception Thrown
IV79548 101722 Reliability and Serviceability UNABLE TO DISPLAY IFA STATUS WHEN READING ZOS SYSTEM DUMPS IN JDMPVIEW 3 30 Usability
IV78632 102142 Security ‘SHA-256 SIGNATURE NOT AVAILABLE’ IN SOLARIS 3 30 Exception Thrown
IV79924 104785 Security APPLICATION IS HANG DUE TO BLOCKING JSSE THREAD 3 30 Hang
IV78491 102399 Security CERTIFICATE CRL IS UNABLE TO BE RETRIEVED 3 30 Unexpected Behaviour
IV80331 105216 Security FIX SECURITY VULNERABILITY CVE-2015-7575 3 30 Security Vulnerability
IV78605 101924 Security JAVA.LANG.NULLPOINTEREXC EPTION WHEN USING KTAB.EXE TO LIST ENTRIES 3 30 Exception Thrown
IV79831 105186 Security JGSS DOES NOT RECOGNIZE ARCFOUR-HMAC-MD5 AS AN ENCRYPTION TYPE. 3 30 Exception Thrown
IV79323 104216 Security JGSS THROWS EXCEPTION WHEN DEFAULT REALM IS NOT AVAILABLE. 3 30 Unexpected Behaviour
IV79083 102495 Security LIBSTATUS.SO IS NOT PROPERLY ZAAP ENABLED ON Z/OS 3 30
IV78572 102686 Security LOGINCONTEXT.LOGIN() IS PRINTING DEBUG MESSAGES BY DEFAULT 3 30 Unexpected Behaviour
IV79094 103647 Security NPE IS THROWN WHEN NO CREDENTIAL IS FOUND. 3 30
IV78711 101694 Security SSLENGINE CLIENT HANG WHEN USING RSA_EXPORT 3 30 Hang
IV79144 103762 Security THE PKCS11IMPLKS KEYSTORE OF THE IBMPKCS11IMPL PROVIDER FAILS TO RECOGNIZE ALL PRIVATE KEYS PRESENT ON THE CRYPTO HARDWARE 3 30
IV79669 104837 Security XML SIGNATURE CANNOT BE VERIFIED 3 30 Unexpected Behaviour
IV80583 103543 XML FIX SECURITY VULNERABILITY CVE-2016-0466 3 30 Security Vulnerability
IV79800 105140 XML FORMAT-NUMBER FUNCTION DOES NOT CONVERT VALUE TO STRING IMPLICITLY 3 30 Exception Thrown
PI50464 102529 z/OS Extentions JZOS SMF 121.1 RECORD DSECT WRONG 3 30 Documentation
IV79390 104383 z/OS Extentions SECURITY VULNERABILITY IN IBMJCECCA (TRACKING NUMBER W498) 3 30 Security Vulnerability

7.1 Service Refresh 3 Fix Pack 20

Technote for this SR/FP

APAR Defect Component Oracle Bug ID Abstract SR FP Defect Type
New Features/Enhancements
IV77423 100716 Consumability SHIP HEALTH CENTER AGENT 3.0.6 IN JAVA SDK 3 20
IV77386 98123 Class Libraries ORACLE DEPLOY UPGRADE TO LEVEL 7U91-B06 3 20
IV77389 100277 Class Libraries ORACLE DEPLOY UPGRADE TO LEVEL 7U91-B13 3 20
IV77743 100832 Class Libraries ORACLE DEPLOY UPGRADE TO LEVEL 7U91-B14 3 20
IV76937 98394 Class Libraries ORACLE JCL UPGRADE TO LEVEL 7U91-B06 3 20
IV77087 100164 Class Libraries ORACLE JCL UPGRADE TO LEVEL 7U91-B13 3 20
IV77984 101601 Class Libraries ORACLE JCL UPGRADE TO LEVEL 7U91-B15 3 20
IV76069 97934 Class Libraries SUPPORT EBCDIC CODE PAGE IBM-1379 – TRADITIONAL CHINESE MIXED EXTENDED HOST 3 20
IV78100 100856 Class Libraries UPDATE TIMEZONE INFORMATION TO TZDATA2015G 3 20
IV78393 102389 Java Virtual Machine ADD MORE -DJAVA.SECURITY.DEBUG OPTIONS 3 20
IX90164 100484 ORB UPGRADE IBMCFW.JAR 3 20
Defect Fixes
IV86208 114369 Consumability HEALTH CENTER MONITORING-API.JAR INCLUDED WITH JVM 3 20 Documentation
IV77916 97797 Class Libraries COM.IBM.NET.RDMA.JVERBS. DEVICECONSTANTS NOT HONOURING THE SPECIFIED DEVICE ATTRIBUTE VALUES 3 20 Performance
IV75409 96701 Class Libraries COM.SUN.IMAGEIO.PLUGINS. PNG.PNGIMAGEREADER THROWS OUTOFMEMORYERROR WITH MALFORMED/CORRUPT PNG IMAGE 3 20 Out of Memory
IV75640 97031 Class Libraries FILE NOT FOUND EXCEPTION AT THE SERVER SIDE DURING THE LAUNCH OF A JAVA WEB START APPLICATION OVER HTTPS CONNECTIONS. 3 20
IV78226 97399 Class Libraries FIX SECURITY VULNERABILITY CVE-2015-4805 3 20 Security Vulnerability
IV78234 97457 Class Libraries FIX SECURITY VULNERABILITY CVE-2015-4806 3 20 Security Vulnerability
IV78233 97436 Class Libraries FIX SECURITY VULNERABILITY CVE-2015-4810 3 20 Security Vulnerability
IV78242 97478 Class Libraries FIX SECURITY VULNERABILITY CVE-2015-4840 3 20 Security Vulnerability
IV78224 97392 Class Libraries FIX SECURITY VULNERABILITY CVE-2015-4843 3 20 Security Vulnerability
IV78222 97385 Class Libraries FIX SECURITY VULNERABILITY CVE-2015-4844 3 20 Security Vulnerability
IV78228 97406 Class Libraries FIX SECURITY VULNERABILITY CVE-2015-4860 3 20 Security Vulnerability
IV78231 97413 Class Libraries FIX SECURITY VULNERABILITY CVE-2015-4883 3 20 Security Vulnerability
IV78237 97443 Class Libraries FIX SECURITY VULNERABILITY CVE-2015-4902 3 20 Security Vulnerability
IV78244 97519 Class Libraries FIX SECURITY VULNERABILITY CVE-2015-4903 3 20 Security Vulnerability
IV78401 100558 Class Libraries FPGA – MEMORY OVERWRITE DURING SCRATCH AREA UPDATE 3 20
IV75655 97356 Class Libraries HANG / HIGH CPU IN JAVA.NET.PLAINSOCKETIMPL .SOCKETCLOSE0 O PLATFORM 3 20
IV77393 100619 Class Libraries INCORRECT BIDI TRANSFORMATION OF ARABIC TAIL CHARACTER 3 20 Unexpected Behaviour
IV71947 89053 Class Libraries INCORRECT CONVERSIONS BETWEEN JAVA.NET.URI AND JAVA.NIO.FILE.PATH 3 20 Functional Issue
IV77344 99032 Class Libraries INVALID CLASSPATH ENTRY: $JAVA_HOME/JRE/LIB/JLM.J AR 3 20 Packaging
IV78193 97952 Class Libraries JAVA.LANG.NULLPOINTEREXC EPTION WITH EUC_KR AND IBM970 DECODER 3 20 Exception Thrown
IV75739 97766 Class Libraries JAVA.NET.MALFORMEDURLEXC EPTION WHEN SYSTEM PROPERTY ‘JAVA.SYSTEM.CLASS.LOADE R’ IS DEFINED. 3 20 Exception Thrown
IV76582 98868 Class Libraries JAVA WEBSTART CRASHES ON UNIX PLATFORMS WHEN SYSTEM DATE IS AHEAD OF JAVA EXPIRATION DATE. 3 20 Crash
IV77818 101336 Class Libraries Multiple failures with java.lang.ProcessBuilder on AIX after applying the APAR IV52649 3 20 Crash
IV76646 96572 Class Libraries NETWORKINTERFACE ISLOOPBACK() METHOD IS BROKEN IN THE PRESENCE OF MULTIPLE TCP STACKS ON Z/OS 3 20
IV75837 97795 Class Libraries REPLACEMENT CHARACTER FOR SOME EBCDIC CONVERTERS IS INCORRECT 3 20 Unexpected Behaviour
IV76658 93770 Class Libraries SUPPORT SIO_LOOPBACK_FAST_PATH OPTION ON WINDOWS 3 20 Usability
IV77650 93771 Class Libraries SUPPORT TOS IN IPV6 HEADERS 3 20
IV78029 99235 Class Libraries TIMEZONE.GETDISPLAYNAME() WRONGLY RETURNS NULL FOR SOME TIME ZONES 3 20 Exception Thrown
IV78109 100101 Java Virtual Machine ADD ADDITIONAL TRACING TO CLASSLOADER UNLOAD SEQUENCE 3 20 Performance
IV76963 99986 Java Virtual Machine A java.lang.IllegalAccessE rror is received when accessing an inner class 3 20 Exception Thrown
IV75047 96359 Java Virtual Machine CLASS REDEFINITION TAKES LONGER TIME OVER PERIOD OF EXECUTION 3 20 Performance
IV77500 97851 Java Virtual Machine CLASS SERIALIZATION INCONSISTENCY ACROSS JVMS DUE TO INCORRECT RETURN VALUE FROM CLASS.GETMODIFIERS 3 20
IV77499 96414 Java Virtual Machine COMMAND-LINE OPTIONS -XTHR: ARE IGNORED 3 20 Performance
IV76873 97310 Java Virtual Machine DEFAULT MAXIMUM STACK SIZE FOR JAVA THREADS HAS BEEN INCREASED 3 20
IV75651 97333 Java Virtual Machine DUMP EVENT “TRACEASSERT” IS RECEIVED 3 20 Crash
IV78236 97440 Java Virtual Machine FIX SECURITY VULNERABILITY CVE-2015-4871 3 20 Security Vulnerability
IV76733 99269 Java Virtual Machine JVM FOOTPRINT INCREASE WHEN USING SHAREDCLASSFILTER 3 20 Functional Issue
IV75563 96745 Java Virtual Machine JVM HANG WITH -XGCPOLICY:METRONOME AND JVMTI CAN_TAG_OBJECTS CAPABILITY 3 20 Hang
IV77448 87565 Java Virtual Machine JVMTI ITERATETHROUGHHEAP CALLBACKS INCORRECTLY ABORTS 3 20 Functional Issue
IV77910 96637 JIT Compiler CRASH, ERROR, OR UNDEFINED BEHAVIOR ON AIX 3 20 Exception Thrown
IV78462 101391 JIT Compiler CRASH DURING JIT COMPILATION 3 20 Crash
IV77449 99546 JIT Compiler CRASH OR INCORRECT BEHAVIOUR ON POWER PLATFORMS DUE TO AN INCORRECTLY REMOVED LOAD INSTRUCTION 3 20 Crash
IV78328 102218 JIT Compiler INCONSISTENT RETURN VALUE FOR JAVA/LANG/MATH.LOG ON X86 3 20
IV74636 94980 JIT Compiler JAVA 7.1/8.0 JIT PPC: POSSIBLE BAD ARRAY TRANSLATE FROM 16 TO 8 BIT CHARACTERS WHEN NON-LATIN CHARACTERS ARE PRESENT 3 20 Unexpected Behaviour
IV77502 100257 JIT Compiler JAVA JIT: OBJECT CORRUPTION RESULTING IN A CRASH OR ASSERT IN GC 3 20 Crash
IV75672 97626 JIT Compiler JAVA JIT- NULLPOINTEREXCEPTION 3 20 Exception Thrown
IV76414 98789 JIT Compiler JAVA JIT POWER: SIGSEGV IN FINDHELPERTRAMPOLINE() 3 20 Crash
IV77912 94117 JIT Compiler JAVA OBJECT DOES NOT GET CLEANED UP WHEN IT SHOULD HAVE BEEN 3 20 Unexpected Behaviour
IV78207 96490 JIT Compiler JAVA SEGMENTATION ERROR IN ESCAPE ANALYSIS 3 20 Crash
IV78209 97953 JIT Compiler JAVA SEGMENTATION ERROR IN VALUE PROPAGATION 3 20 Crash
IV77682 99713 JIT Compiler JAVA SEGMENTATION ERROR WITH VMSTATE=0X0005FF05 ON X86 3 20 Crash
IV77913 93479 JIT Compiler JVM CRASHES IN AOT COMPILED METHOD 3 20 Crash
IV78431 98632 JIT Compiler JVM CRASHES IN THE JIT COMPILER 3 20 Crash
IV76382 96374 JIT Compiler JVM EXPERIENCE MINOR PERFORMANCE REGRESSION ON SMALL WORKLOAD 3 20
IV75565 96659 JIT Compiler JVM FAILS TO PROPERLY CONVERT A VALUE BETWEEN BIG ENDIAN AND LITTLE ENDIAN 3 20 Functional Issue
IV77385 96054 JIT Compiler JVM HANGS ON JIT COMPILATION THREAD 3 20 Hang
IV78108 95847 JIT Compiler JVM MAY CRASH DURING JIT COMPILATION IF AOT COMPILATION IS ENABLED 3 20 Crash
IV75564 96677 JIT Compiler JVM SEGMENTATION ERROR IN JIT MODULE 3 20 Crash
IV77908 90492 JIT Compiler NESTED LOOP IN JIT COMPILED METHOD DOES NOT TERMINATE WHEN EXPECTED 3 20 Unexpected Behaviour
IV76415 86048 JIT Compiler SLIGHTLY LOWER PERFORMANCE FOR CERTAIN PROGRAMS IN JAVA 7.1 3 20 Performance
IV78389 97930 JIT Compiler UNEXPECTED CRASH OR EXCEPTION IN VICINITY OF A CALL TO OBJECT.CLONE 3 20
IV78386 98776 JIT Compiler UNEXPECTED JAVA EXCEPTION WHILE EXECUTING SOME METHODS IN THE JAVA.LANG.METHODHANDLE CLASS 3 20 Exception Thrown
IV78390 97715 JIT Compiler UNEXPECTED NOSUCHMETHODEXCEPTION FROM JAVA.LANG.METHODHANDLE CODE 3 20 Exception Thrown
IV76872 97378 JIT Compiler UNEXPECTED NULLPOINTEREXCEPTION WHEN CALLING UNSAFE.COMPAREANDSWAP* WITH A NULL OBJECT ON P AND Z PLATFORMS 3 20
IX90167 97427 ORB FIX SECURITY VULNERABILITY CVE-2015-4835 3 20 Security Vulnerability
IX90168 97512 ORB FIX SECURITY VULNERABILITY CVE-2015-4882 3 20 Security Vulnerability
IX90166 100589 ORB ORB KEEP ALIVE THREAD MAY BE ACTIVE PREVENTING THE JAVA PROCESS TO EXIT 3 20
IV76922 99406 Reliability and Serviceability JDMPVIEW OUT OF MEMORY ERROR WHILE OPENING A Z/OS SYSTEM DUMP 3 20
IV76132 97028 Reliability and Serviceability JVM FAILS TO RENAME CORE DUMP FROM CHILD PROCESS IF %T IS SPECIFIED IN CORE_PATTERN 3 20
IV76936 95116 Reliability and Serviceability POOR PERFORMANCE WHEN RUNNING JDMPVIEW COMMANDS ON LARGE SYSTEM DUMPS 3 20
IV76659 97798 Security AES/CTR DOESN’T BEHAVE STREAM CIPHER LIKE 3 20 Unexpected Behaviour
IV75770 96283 Security ARITHMETICEXCEPTION WHEN CALLING KEYSTORE.GETKEY() FOR PKCS12 3 20 Unexpected Behaviour
IV78753 92692 Security CANNOT CUSTOMIZE DH KEYSIZE IN JAVA 7 AND BEFORE 3 20 Security Vulnerability
IV77051 99979 Security CIPHER MODES GCM/CFB/OFB FAIL USING IBMJCECCA CRYPTO PROVIDER ON Z13 WITH CEX5 CARD 3 20 Functional Issue
IV76737 99419 Security CMS PROVIDER AND IKEYMAN – BAD KEYSTORE ENCODING CAUSES DATA LOSS DURING PASSWORD CHANGE OPERATION 3 20
IV77593 100799 Security CRASH CALLING SECURERANDOM.GENERATESEE D(0) WITH SHA1PRNG 3 20 Crash
IV75168 94824 Security DEADLOCK IN JSSE SSLSOCKETIMPL WHEN PERFORMING A SELF-INITIATED CLOSE 3 20 Unexpected Behaviour
IV76099 81833 Security DEPRECATE PLATFORM-DEPENDENT JAAS PRINCIPAL AND LOGINMODULE 3 20 Standards Noncompliance
IV76239 97940 Security EXCLUSIVE CANONICALIZATION IN XML IS WRONGLY PERFORMED 3 20
IV78248 97533 Security FIX SECURITY VULNERABILITY CVE-2015-4734 3 20 Security Vulnerability
IV78239 97450 Security FIX SECURITY VULNERABILITY CVE-2015-4872 3 20 Security Vulnerability
IV78316 99752 Security FIX SECURITY VULNERABILITY CVE-2015-5006 3 20 Security Vulnerability
IV77572 97108 Security JGSS THROWS EXCEPTION WHEN DNS_LOOKUP_REALM OR DNS_LOOKUP_KDC HAS A VALID VALUE. 3 20 Usability
IV76240 97657 Security NAMESPACE MISSING WHEN ‘JAVAX.XML.CRYPTO.DSIG.C ACHEREFERENCE’ SET TO TRUE 3 20 Unexpected Behaviour
IV75769 97294 Security NULLPOINTEREXCEPTION THROWN WHEN LOGIN WITH LINUXLOGINMODULE AND JAASLOGINMODULE 3 20 Exception Thrown
IV76735 98376 Security PROBLEM WITH COMPARISON OF DH KEYS 3 20
IV77015 99844 Security SETTING PSSPARAMETERSPEC DOES NOT APPLY HASH ALGORITHM 3 20 Unexpected Behaviour
IV75772 96113 Security THE AMOUNT OF REREAD DATA IS LESS THAN THE EXPECTED AMOUNT AFTER ENCRYPTION 3 20 Unexpected Behaviour
IV77652 101242 Security WRONG SESSION SUBKEY RETURNED FROM EXTENDEDGSSCONTEXT.INQUI RESECCONTEXT() 3 20 Unexpected Behaviour
IV78246 89620 XML FIX SECURITY VULNERABILITY CVE-2015-4803 3 20 Security Vulnerability
IV78243 97505 XML FIX SECURITY VULNERABILITY CVE-2015-4842 3 20 Security Vulnerability
IV78241 97471 XML FIX SECURITY VULNERABILITY CVE-2015-4893 3 20 Security Vulnerability
IV76199 98708 XML JAXP ASSUMES ALL PARSERS TO SUPPORT ACCESS_EXTERNAL_DTD PROPERTY AND SECURE PROCESSING FEATURE. 3 20 Exception Thrown
IV77422 100700 XML VALUES OF DOCTYPE-SYSTEM, DOCTYPE-PUBLIC AND CDATA-SECTION-ELEMENTS FROM XSL ARE NOT HANDLED PROPERLY WHEN TRANSFORMED ONTO A SA 3 20
PI47846 96462 z/OS Extentions UPDATE THE IBMJCECCA PROVIDER WITH SUPPORT FOR AES AND DESEDE TRANSPORT KEYS 3 20
PI47847 96263 z/OS Extentions UPDATE THE JZOS BATCH LAUNCHER WITH ADDITIONAL SMF LOGGING FUNCTIONALITIES SUCH AS PERIODIC LOGGING AND CPU USAGE STATISTICS 3 20 Currency

7.1 Service Refresh 3 Fix Pack 10

Technote for this SR/FP

APAR Defect Component Oracle Bug ID Abstract SR FP Defect Type
New Features/Enhancements
IV73610 91286 Class Libraries ORACLE DEPLOY UPGRADE TO LEVEL 7U85-B09 3 10
IV74446 94497 Class Libraries ORACLE DEPLOY UPGRADE TO LEVEL 7U85-B15 3 10
IV75007 91890 Class Libraries ORACLE JCL UPGRADE TO LEVEL 7U85-B11 3 10
IV74401 93878 Class Libraries ORACLE JCL UPGRADE TO LEVEL 7U85-B15 3 10
IV74749 90626 Class Libraries TRANSLATION MESSAGES UPDATE FOR JDK 3 10
IV74574 93393 Class Libraries UPDATE TIMEZONE INFORMATION TO TZDATA2015E 3 10
Defect Fixes
IV72914 90737 Java 8/Packaging HEALTH CENTER AGENT PACKAGE MISSING MQTT FILE 3 10
IV72018 89124 Class Libraries CRASH IN SOCKET IO CALLS IN IBM JAVA 7, JAVA 727 AND JAVA 8 3 10
IV75143 89508 Class Libraries FIX SECURITY VULNERABILITY CVE-2015-2590 3 10 Security Vulnerability
IV75156 89578 Class Libraries FIX SECURITY VULNERABILITY CVE-2015-2619 3 10 Security Vulnerability
IV75157 89599 Class Libraries FIX SECURITY VULNERABILITY CVE-2015-2621 3 10 Security Vulnerability
IV75154 89899 Class Libraries FIX SECURITY VULNERABILITY CVE-2015-2632 3 10 Security Vulnerability
IV75180 89571 Class Libraries FIX SECURITY VULNERABILITY CVE-2015-2637 3 10 Security Vulnerability
IV75126 89480 Class Libraries FIX SECURITY VULNERABILITY CVE-2015-2638 3 10 Security Vulnerability
IV75152 89564 Class Libraries FIX SECURITY VULNERABILITY CVE-2015-2664 3 10 Security Vulnerability
IV75165 89662 Class Libraries FIX SECURITY VULNERABILITY CVE-2015-4729 3 10 Security Vulnerability
IV75145 89515 Class Libraries FIX SECURITY VULNERABILITY CVE-2015-4731 3 10 Security Vulnerability
IV75133 89501 Class Libraries FIX SECURITY VULNERABILITY CVE-2015-4732 3 10 Security Vulnerability
IV75130 89494 Class Libraries FIX SECURITY VULNERABILITY CVE-2015-4733 3 10 Security Vulnerability
IV75149 89550 Class Libraries FIX SECURITY VULNERABILITY CVE-2015-4736 3 10 Security Vulnerability
IV75163 89641 Class Libraries FIX SECURITY VULNERABILITY CVE-2015-4749 3 10 Security Vulnerability
IV75147 89543 Class Libraries FIX SECURITY VULNERABILITY CVE-2015-4760 3 10 Security Vulnerability
IV74043 93302 Class Libraries INCREASE IN THE NUMBER OF SYSTEM.GC() CALLS AFTER APPLYING IV68743 3 10 Performance
IV75622 92394 Class Libraries JAVA.IO.PIPEDINPUTSTREAM .AVAILABLE() RETURNS INTEGER.MAX_VALUE I.E., 2147483647 ON EMPTY STREAM IN JAVA 7 3 10
IV71267 87951 Class Libraries java.util.TimeZone.getDi splayName() gives incorrect timezone display names. 3 10
IV72873 90523 Class Libraries MAX SGE LIMIT EXCEEDED EXCEPTION EVEN IF IT HAS NOT REALLY EXCEEDED 3 10 Exception Thrown
IV74621 93739 Class Libraries ORACLE DEPLOY UPGRADE TO LEVEL 7U85-B13 3 10
IV74134 93549 Class Libraries Performance degradation due to OS name check in SBCS Decoder side 3 10 Performance
IV87263 89023 Class Libraries PERFORMANCE DEGRADATION WITH JAVA.IO.PRINTWRITER OBJECTS 3 10 Performance
IV52649 54992 Class Libraries PERFORMANCE ISSUE WITH JAVA.LANG.RUNTIME.EXEC() ON AIX 3 10 Functional Issue
IV73421 91975 Class Libraries TIME ZONE SHOWS AS GMT+00/GMT-00 INSTEAD OF GMT 3 10 Unexpected Behaviour
IV74382 81346 Java Virtual Machine ADAPTIVE SPIN OCCASIONALLY REDUCES THROUGHPUT 3 10 Performance
IV72112 89060 Java Virtual Machine BYTECODE VERIFIER INCORRECTLY REJECTING CLASS WITH ‘IFNULL’ BYTECODE OF ‘UNINITIALIZED_THIS’ 3 10
IV73276 90340 Java Virtual Machine COMPRESSED REFERENCES JVM CRASHES ATTEMPTING TO GROW JAVA STACK 3 10 Unexpected Behaviour
IV72740 88681 Java Virtual Machine CREATING JAVA THREAD WITHIN PROCESS THREAD RENAMES THE PROCESS NAME TO ‘MAIN’ ON LINUX 3 10 Unexpected Behaviour
IV73636 91267 Java Virtual Machine INCREASED FOOTPRINT FOR WAS WITH JAVA 8 SR1 AFTER APPLYING APAR IV71942 3 10
IV72100 87639 Java Virtual Machine JAVA VM HANGS ON SHUTDOWN WHEN FINALIZER THREAD SUSPENDED 3 10 Hang
IV72854 89396 Java Virtual Machine JVM FAILED TO LAUNCH ON WINDOWS WHEN RUN FROM SHARED NETWORK DRIVE 3 10 Functional Issue
IV73612 91855 Java Virtual Machine JVM IS UNABLE TO START IF CACHEDIR PATH IS TOO LONG AND -XSHARECLASSES SUB-OPTIONS IN TOTAL ARE MORE THAN 256 CHARACTERS 3 10
IV74481 94059 Java Virtual Machine JVM MAY CRASH WHEN JVMTI CONTENDED MONITOR EVENTS ENABLED 3 10 Crash
IV73637 90934 Java Virtual Machine JVM MAY HANG IF IT FAILS TO CREATE NEW CONTROL FILE FOR NON-PERSISTENT SHARED CLASS CACHE 3 10 Hang
IV74070 93596 Java Virtual Machine JVMS FAIL TO START UP WHEN DETECTING A CORRUPTED CACHE 3 10
IV72941 90615 Java Virtual Machine JVMTI CAN_TAG_OBJECTS CAPABILY UNAVAILABLE IN LIVE PHASE 3 10 Functional Issue
IV74133 93341 Java Virtual Machine MEMORY LEAK EVERY GARBAGE COLLECTION ON AIX-PPC 3 10 Performance
IV73535 89873 Java Virtual Machine NUMBER OF GARBAGE COLLECTOR THREADS INCLUDES UNAVAILABLE PROCESSORS 3 10 Unexpected Behaviour
IV72102 88930 Java Virtual Machine ON Z/OS, A 64-BIT JVM DOES NOT DELETE SHARED CLASS CACHE CREATED BY 31-BIT JVM 3 10 Functional Issue
IV73742 92242 Java Virtual Machine PARTIALLY USED LAST PAGE IN DEBUG DATA AREA IN SHARED CACHE IS NOT MARKED READ-ONLY 3 10 Unexpected Behaviour
IV74619 89331 Java Virtual Machine REDUCED NUMBER OF GARBAGE COLLECTOR THREADS WHEN USING MULTIPLE NUMA NODES 3 10 Functional Issue
IV73677 91688 Java Virtual Machine REMOVE ASSERTION ON CHECK OF PARAMETERS FOR JNI CALL OF RELEASEPRIMITIVEARRAYCRI TICAL() 3 10 Unexpected Behaviour
IV73051 90603 Java Virtual Machine SECURITY CHECKS IN THREADMXBEANIMPL CREATE A NEW PERMISSION OBJECT EVERY TIME 3 10
IV71873 88959 Java Virtual Machine SIGNED APPLET FAILS DUE TO COM.SUN.DEPLOY.SECURITY. BLOCKEDEXCEPTION 3 10 Unexpected Behaviour
IV71812 88416 Java Virtual Machine STRING.TOLOWERCASE() VIOLATES UNICODE STANDARD 3 10 Unexpected Behaviour
IV73639 89944 Java Virtual Machine THE VERBOSEGC LOG DOES NOT CONTAIN NUMBER OF ACTIVE GC THREADS 3 10
IV71982 88816 Java Virtual Machine VIRTUAL MEMORY RESERVED FOR OBJECT HEAP MIGHT BE BIGGER THAN NECESSARY FOR AIX64 3 10 Unexpected Behaviour
IV74227 87860 JIT Compiler A JAVA/LANG/NULLPOINTEREXC EPTION IS NOT CAUGHT WITHIN A TRY/CATCH BLOCK 3 10 Exception Thrown
IV75117 86228 JIT Compiler ARRAYINDEXOUTOFBOUNDSEXC EPTION DUE TO A PROBLEM IN A LOOPSTRIDER 3 10 Unexpected Behaviour
IV76341 86110 JIT Compiler CRASH DURING COMPILATION IN BIFSIMPLIFIER OPT 3 10 Crash
IV74000 89935 JIT Compiler CRASH DURING JIT COMPILATION IN TR_S390MACHINE::FREEBEST REGISTER 3 10 Crash
IV74405 92036 JIT Compiler CRASH IN JIT COMPILED CODE OR GC, OR MEMORY CORRUPTION 3 10
IV73847 90516 JIT Compiler INTEGER OBJECT HAS THE WRONG VALUE INSIDE A LOOP 3 10 Unexpected Behaviour
IV74006 93460 JIT Compiler JAVA CRASH WITH INVALID BRANCH TARGET (0X0) 3 10 Unexpected Behaviour
IV74398 88487 JIT Compiler JIT COMPILER NOT FREEING ALL MEMORY ALLOCATED VIA STORAGE OBTAIN ON SHUTDOWN 3 10 Out of Memory
IV74067 85260 JIT Compiler JVM CRASHES IN JIT MODULE DURING START-UP IN EMULATED 31BIT ZLINUX OS 3 10 Crash
IV73861 90455 JIT Compiler SEGMENTATION FAULT IN THE JVM WHEN INVOKING A JNI METHOD IN A JIT COMPILED BODY 3 10 Crash
IV72333 85981 JIT Compiler UNHANDLED EXCEPTION IN JAVA JIT COMPILER 3 10 Crash
IX90162 90456 ORB ORB TRACE IS FLOODED WITH ‘JAVA.NET.NOROUTETOHOSTE XCEPTION: EDC8116I ADDRESS NOT AVAILABLE.’ 3 10
IV73638 90286 Reliability and Serviceability DTFJ API COM.IBM.DTFJ.JAVA.JAVATH READ.GETOBJECT() RETURNS INCORRECT DATA WHEN READING IN-FLIGHT SYSTEM DUMPS 3 10 Unexpected Behaviour
IV73188 90676 Reliability and Serviceability ERRORS LOADING PHD HEAPDUMPS INTO MEMORY ANALYZER 3 10
IV74107 87376 Reliability and Serviceability JAVA TDUMPS ON ZOS ARE NOT UNIQUELY NAMED 3 10 Functional Issue
IV73611 91923 Reliability and Serviceability JDMPVIEW LOOPS WHEN OPENING ZOS SYSTEM DUMP 3 10
IV72871 86446 Reliability and Serviceability JVM CRASH WHEN HANDLING EARLY ASSERT OR ABORT SIGNAL 3 10 Crash
IV73609 86785 Reliability and Serviceability READING ZOS SVCDUMPS WITH JDMPVIEW DIRECT FROM MVS DATASETS IS VERY SLOW 3 10 Performance
IV73361 90951 Reliability and Serviceability TRACE TRIGGER ACTION ‘ABORT’ IGNORED. 3 10 Functional Issue
IV73848 92818 Service, Build, Packaging and Delivery SDK INSTALLSHIELD PACKAGE FAILS TO INSTALL IN SILENT MODE IF USED WITH A GENERATED RESPONSE FILE 3 10 Packaging
IV74625 93945 Security ‘INTEGRITY CHECK FAILED’ WHILE UNWRAPPING TOKEN IN JGSS 3 10 Exception Thrown
IV74622 93946 Security ALL SUBSEQUENT SSL HANDSHAKES FAIL AFTER ONE FAILING SSL HANDSHAKE 3 10 Functional Issue
IV73094 90677 Security DOMEXCEPTION THROWN WHEN SIGNING DATA IF EMPTY NAMESPACE PREFIX PROVIDED 3 10 Unexpected Behaviour
IV74628 93938 Security EXCEPTION HAPPENS WHEN DECODING AES WRAP TOKEN IF RR COUNT IS NOT ZERO. 3 10 Exception Thrown
IV73189 91195 Security FIX APAR IV55720: JSSE CONNECTION FAILED WHEN USING HASHDRBG IN FIPS MODE 3 10 Functional Issue
IV75182 90903 Security FIX SECURITY VULNERABILITY CVE-2015-1931 3 10
IV75161 89613 Security FIX SECURITY VULNERABILITY CVE-2015-2601 3 10 Security Vulnerability
IV75160 89606 Security FIX SECURITY VULNERABILITY CVE-2015-2613 3 10 Security Vulnerability
IV75166 89669 Security FIX SECURITY VULNERABILITY CVE-2015-2625 3 10 Security Vulnerability
IV75150 89557 Security FIX SECURITY VULNERABILITY CVE-2015-4748 3 10 Security Vulnerability
IV74002 93590 Security IBMPKCS11IMPL.INIT METHOD CLEARING USER SUPPLIED PASSWORD 3 10
IV73406 91652 Security INCORRECT PRINCIPAL PICKED TO PERFORM KRB5 LOGIN 3 10 Exception Thrown
IV74069 93670 Security LARGE PRE-MASTER SECRET GENERATED FROM 2048 BIT DH KEY NOT DIGESTED IN TLSV1 AND TLSV1.1 3 10 Functional Issue
IV73403 91382 Security PASSWORD LEFT IN MEMORY WITHIN IBMPKCS11IMPL.LOGIN METHOD 3 10 Security Vulnerability
IV74631 93973 Security PKCS11IMPL SECURITY PROVIDER PROBLEMS WITH MEMORY MANAGEMENT AFTER CIPHER EXCEPTION THROWN 3 10 Exception Thrown
IV73743 92216 Security PKCS ALGORITHMID.GETNAME() RETURNS ‘DIFFIE-HELLMAN’ 3 10
IV74537 94101 Security SEQUENCE NUMBER MISMATCH IN AP-REP AND ENCAPREPPART. 3 10 Usability
IV73306 90649 Security SIGNATURE FAILURES WITH CLEAR KEY OPERATIONS WHEN ICSF MASTER KEY CHANGES 3 10 Exception Thrown
PI42837 91706 z/OS Extentions IBMJCECCA IMPLEMENTATION OF KEYGENERATOR#INIT() DOES NOT RESET THE KEYGENERATOR BEFORE INITIALIZATION 3 10

7.1 Service Refresh 3 Fix Pack 1

APAR Defect Component Oracle Bug ID Abstract SR FP Defect Type
Defect Fixes
IV73934 89655 Security FIX SECURITY VULNERABILITY CVE-2015-4000 3 1 Security Vulnerability

7.1 Service Refresh 3

Technote for this SR/FP

APAR Defect Component Oracle Bug ID Abstract SR FP Defect Type
New Features/Enhancements
IV71990 85022 Class Libraries ADD SUPPORT FOR VIETNAMESE (CP1130 AND CP1164) CODEPAGES IN IBM JDK 3
IV69701 85801 Class Libraries ORACLE DEPLOY UPGRADE TO LEVEL 7U79-B08 3
IV71813 88019 Class Libraries ORACLE DEPLOY UPGRADE TO LEVEL 7U79-B14 3
IV69376 85361 Class Libraries ORACLE JCL UPGRADE TO LEVEL 7U79-B08 3
IV71945 88016 Class Libraries ORACLE JCL UPGRADE TO LEVEL 7U79-B14 3
IV68890 83258 Security PROVIDING PROPERTY TO MAKE ‘SSLV3’ MATCHING ‘SSL’ BEHAVIOR 3 Usability
IV68856 82544 Security SOME NEW FEATURES AND FIXES 3 Unexpected Behaviour
PI39622 85062 z/OS Extentions JZOS BATCH LAUNCHER SMF RECORDING UPDATE AND MESSAGE UPDATE 3
Defect Fixes
IV72568 85706 Class Libraries API/JAVA_NIO/CHARSET/CHA RSET/INDEX.HTML#METHODS FAILS WITH JAVA.LANG.NOCLASSDEFFOUN DERROR 3 Exception Thrown
IV68357 82473 Class Libraries BIDI CODE TRANSFORMATION REORDERING ISSUE 3 Unexpected Behaviour
IV69759 85683 Class Libraries CRASH IN JVM WHEN PID GREATER THAN 6 DIGITS NUMBER ON AIX 3 Crash
IV68216 82285 Class Libraries DEADLOCK WHEN A FILEWRITER IS WORKED ON CONCURRENTLY BY MORE THAN ONE WRITER INSTANCES 3 Hang
IV71832 82103 Class Libraries DEFAULT FONT INSTALLATION PATH UNDEFINED FOR AIX AND ZOS 3 Exception Thrown
IV72615 81527 Class Libraries DISABLE POLLSETARRAYWRAPPER IN JDK 71 FOR IBM I 3
IV69880 72408 Class Libraries FAILS TO LAUNCH JAVA WHEN UNSUPPORTED ENCODING IS SET 3 Exception Thrown
IV67303 76690 Class Libraries FONTS WITH ITALIC OR BOLD STYLE ARE CORRUPTED IN PPC64LE 3 Unexpected Behaviour
IV68743 83297 Class Libraries GC STORM INDUCED BY DIRECT BYTE BUFFER (DBB) 3 Performance
IV69886 80039 Class Libraries IBM1362 DECODER CANNOT HANDLE SBCS CHARACTER PROPERLY 3 Unexpected Behaviour
IV70518 86190 Class Libraries IMPROVE IBM JAVA RUN-TIME VALIDATION OF EXPIRY 3
IV70977 80429 Class Libraries INTERMITTENTLY RDMA ENDPOINT CONNECT WAITS FOREVER 3 Hang
IV71391 86205 Class Libraries INVALID CONVERSION FOR MS936 3 Unexpected Behaviour
IV68284 82464 Class Libraries JAVA.UTIL.TIMEZONE.GETDE FAULT() ADDS DST OFFSET FOR NON DST DATES IN MULTI-THREADED ENVIRONMENT 3
IV71077 81246 Class Libraries JAVABIDI FEATURE IS NOT WORKING IN NIO CONVERTOR SIDE 3 Unexpected Behaviour
IV70441 82568 Class Libraries JAVAWS GOT COREDUMP AT THE SECOND LAUNCHING ON AIX AFTER APPLYING APAR IV75172 3 Crash
IV71937 81699 Class Libraries JCONSOLE CANNOT SHOW SOME MESSAGES IN ENGLISH 3 Unexpected Behaviour
IV70978 84711 Class Libraries JIBVDEVINFO AND JRPING MISSING IN /BIN 3 Usability
IV68822 83289 Class Libraries LONG DELAY WITH APPLICATION FOR LDAP OPERATIONS 3 Performance
IV65049 74603 Class Libraries ONLY 8192 FILE DESCRIPTORS MAY BE REGISTERED WITH A SELECTOR OBJECT ON AIX 3 Functional Issue
IV71389 86557 Class Libraries REGRESSION CAUSED BY APAR IV51860 3 Unexpected Behaviour
IV69881 82042 Class Libraries SIGSEGV IN TSI_DELETECFFCLASS() FUNCTION OF LIBT2K MODULE. 3 Crash
IV71991 64375 Class Libraries TO ENABLE NEW KEY MANAGER ‘NEWIBMX509KEYMANAGER’ IN IBM JDK 3 Exception Thrown
IV72099 87925 Class Libraries UPDATE CACERTS TO INCLUDE CERTIFICATES FROM BUYPASS 3
IV70621 86762 Class Libraries UPDATE TIMEZONE DATA TO VERSION TZDATA2015A OF THE OLSON DATABASE 3
IV70546 86333 Java Virtual Machine ADDRESS LOCKING CONTENTION IN JAVA/LANG/CLASS.GETGENER ICINTERFACES() AND JAVA/LANG/CLASS.GETCLASS REPOSITORY(). 3 Performance
IV69513 85136 Java Virtual Machine A JAVA.LANG.INTERNALERROR THROWS FROM JAVA.LANG.CLASS.FORNAME() 3 Exception Thrown
IV69126 81628 Java Virtual Machine CRASH IN JVM WHEN UNLOADING CLASSLOADERS DURING GARBAGE COLLECTION 3 Crash
IV70545 86608 Java Virtual Machine DEADLOCK IN CLASS THREADGROUP 3 Hang
IV71293 87596 Java Virtual Machine EXCEPTION ‘ACCESS DENIED’ FOR ACTION ‘JAVA.SECURITY.SECURITYP ERMISSION’ AFTER APPLYING IV68824 3
IV70971 78296 Java Virtual Machine FINALIZER DOES NOT RUN AFTER RUNFINALIZERSONEXIT CALLED 3 Unexpected Behaviour
IV70682 83842 Java Virtual Machine FIX SECURITY VULNERABILITY CVE-2015-0192 3 Security Vulnerability
IV72240 66930 Java Virtual Machine FIX SECURITY VULNERABILITY CVE-2015-1914 3 Security Vulnerability
IV68447 80305 Java Virtual Machine GARBAGE COLLECTOR CRASHES WHEN GENERATING JAVACORE 3 Crash
IV68571 82328 Java Virtual Machine GC CRASH DURING SCAVENGE CYCLE 3 Crash
IV71560 88091 Java Virtual Machine HIGH GC SPINLOCK TIME 3 Performance
IV71669 56014 Java Virtual Machine IMPROVE PERFORMANCE OF JAVA.UTIL.CONCURRENT.COU NTDOWNLATCH AND JAVA.UTIL.CONCURRENT.CYC LICBARRIER 3 Performance
IV71872 88505 Java Virtual Machine INCORRECT INVOKEDYNAMIC BYTECODES RETURNED BY THE CLASS FILE LOAD HOOK OR RETRANSFORM CLASSES 3 Functional Issue
IV70974 87373 Java Virtual Machine JAVA.LIBRARY.PATH ON WINDOWS DOES NOT CONTAIN THE CURRENT DIRECTORY 3 Functional Issue
IV71671 88476 Java Virtual Machine JAVA VM EXITS IF THE FILENAME SPECIFIED BY -XOPTIONSFILE IS NOT FOUND 3
IV71720 82676 Java Virtual Machine JNI ATTACHCURRENTTHREAD() / DETACHCURRENTTHREAD() DO NOT LOG TRACEPOINTS 3 Usability
IV71938 81670 Java Virtual Machine JVM CRASHES WHEN INVOKING ATOE_VSNPRINTF() WITH NON-NULL TERMINATED STRING AS ARGUMENT ON Z/OS PLATFORM 3 Crash
IV68418 81977 Java Virtual Machine JVM CRASHES WHEN USING -XSHARECLASSES AND LOADING A CLASS THAT USES ‘INVOKEDYNAMIC’ BYTECODE 3
IV69860 85600 Java Virtual Machine JVM CRASHES WHILE INCORRECTLY ATTEMPTING TO USE SHARED CLASS CACHE WHEN IT IS RUNNING WITHOUT -XSHARECLASSES OPTION 3 Crash
IV67822 81484 Java Virtual Machine JVM CRASH WHEN THREAD.STOP() IS USED 3 Crash
IV71290 83961 Java Virtual Machine JVM HANGS DURING CLASS INITIALIZATION WITH JVMTI 3 Hang
IV68159 79222 Java Virtual Machine JVM IS NOT THROWING ILLEGALARGUMENTEXCEPTION FROM JAVA.LANG.REFLECT.ARRAY. SET() API WHEN THE ARRAY IS A PRIMITIVE TYPE AND THE V 3 Functional Issue
IV69429 85499 Java Virtual Machine NULLPOINTEREXCEPTION FROM THREAD.TOSTRING() 3 Exception Thrown
IV71191 80844 Java Virtual Machine NULLPOINTEREXCEPTION IN ATTACH API WAIT LOOP 3 Functional Issue
IV71566 87732 Java Virtual Machine NULLPOINTEREXCEPTION THROWN INSTEAD OF EXCEPTIONININITIALIZERER ROR 3 Functional Issue
IV71387 87059 Java Virtual Machine ON 64BIT ZOS PLATFORM CUSTOM LAUNCHER INITIALIZED JVM TERMINATES WITH ABEND OC4 3 Crash
IV69294 85254 Java Virtual Machine ON LINUX JDWP SOCKET FAILS TO INITIALIZE WITH ERROR CODE -247 EVEN AFTER APPLYING APAR IV67287 3
IV70972 82665 Java Virtual Machine ON Z/OS, GPR15 MAY BE CLOBBERED WHEN THE JAVA VM REDUCES THE SIZE OF ITS OBJECT HEAP 3
IV71529 80710 Java Virtual Machine POSSIBLE HANG WITH JAVA INSTRUMENTATION (DEBUGGING)) 3
IV71248 83679 Java Virtual Machine PRESENTATIONS ABOUT CUDA4J REFER TO NON-EXISTENT API 3 Usability
IV71249 87642 Java Virtual Machine SETTING -DJAVA.SYSTEM.CLASS.LOAD ER CAUSES A SECURITYEXCEPTION WHEN USING CRYPTO 3 Exception Thrown
IV70976 80583 Java Virtual Machine SPURIOUS WARNINGS ABOUT IDENTIFIERS FROM -XCHECK:JNI 3 Unexpected Behaviour
IV68042 81610 Java Virtual Machine Z/OS 31-BIT: ONLY HALF OF THE BYTES IN THE FP REGISTERS ARE DISPLAYED FOR A SIGSEGV, SIGILL OR SIGFPE 3
IV72279 86263 JIT Compiler COM/IBM/DATAACCESS/DECIM ALDATA.CONVERTPACKEDDECI MALTOLONG ALWAYS RETURNS 0 3 Functional Issue
IV72526 83985 JIT Compiler COM/IBM/DATAACCESS/DECIM ALDATA.CONVERTPACKEDDECI MALTOLONG DOES NOT THROW AN EXCEPTION WHEN IT SHOULD 3 Performance
IV72528 78421 JIT Compiler CONSECUTIVE CALLS TO COM/IBM/DATAACCESS/BYTEA RRAYMARSHALLER METOHDS MAY RETURN INCORRECT RESULTS 3 Exception Thrown
IV72270 73805 JIT Compiler CRASH CAUSED BY MEMORY CORRUPTION FROM ARRAY DATA COPIED TO THE WRONG ADDRESS 3 Unexpected Behaviour
IV72387 78927 JIT Compiler CRASH DURING COMPILATION WITH VMSTATE=0X0005FF0B 3 Crash
IV67823 81466 JIT Compiler CRASH DURING JIT COMPILATION IN INSTANCEOFORCHECKCAST 3 Crash
IV72672 74980 JIT Compiler CRASH IN COMPILED METHOD WITH SEGMENTATION ERROR VMSTATE=0X000549FF 3 Unexpected Behaviour
IV68417 81135 JIT Compiler CRASH IN JITPREJNICALLOFFLOADCHECK WITH -XCEEHDLR 3 Crash
IV72215 80689 JIT Compiler CRASH IN JIT WITH VMSTATE=0X0005FFFF 3 Crash
IV72219 85051 JIT Compiler CRASH IN TR_RESOLVEDMETHOD::MAKEP ARAMETERLIST 3
IV72675 82433 JIT Compiler CRASH IN TR COMPILER (LOOP STRIDER) 3 Crash
IV72655 81677 JIT Compiler CRASH WHILE STEPPING THROUGH JAVA APPLICATIONS USING JSR292 FEATURES 3 Crash
IV72331 82505 JIT Compiler CRASH WITH VMSTATE=0X00000000 3 Crash
IV72330 74369 JIT Compiler ENFORCING THE MAXIMUM NUMBER OF INLINED METHODS IN INLINER 3 Crash
IV72216 78859 JIT Compiler FINALIZERS MAY NOT BE CALLED FOR OBJECTS ALLOCATED IN JIT COMPILED METHODS 3 Unexpected Behaviour
IV72872 83162 JIT Compiler FIX SECURITY VULNERABILITY CVE-2015-5041 3 Security Vulnerability
IV72218 71313 JIT Compiler HANG DUE TO INLINING SUN/MISC/UNSAFE.PUTORDER EDINT MUTLIPLE TIMES 3 Hang
IV69509 85771 JIT Compiler HANG IN JAVA.UTIL.CONCURRENT.LOC KS.ABSTRACTQUEUEDSYNCHRO NIZER.CONDITIONOBJECT.AW AITNANOS 3 Hang
IV72266 79427 JIT Compiler INCORRECT BEHAVIOUR IN JAVA PROGRAM WHEN A LOOP IS OPTIMIZED 3 Unexpected Behaviour
IV72677 73344 JIT Compiler INCORRECT RESULTS COMPUTED FOR UNUSUAL BYTECODE SEQUENCE 3 Unexpected Behaviour
IV68043 81754 JIT Compiler INCORRECT VALUE PRODUCED FROM FLOATING POINT COMPUTATION 3 Unexpected Behaviour
IV68110 82037 JIT Compiler JAVA 7 MULTI-TYPE EXCEPTION CATCH FAILS TO EXECUTE THE FINALLY BLOCK 3 Unexpected Behaviour
IV72269 74627 JIT Compiler JAVA CRASH AFTER LOADING INVALID TARGET ADDRESS FROM JITTED CODE 3 Crash
IV72278 86441 JIT Compiler JAVA CRASH WITH INVALID BRANCH TARGET 3
IV58626 56223 JIT Compiler JAVA JIT CRASH IN VALUE PROPAGATION 3 Crash
IV67653 80137 JIT Compiler JAVA JIT – HANG OR SLOW COMPILES TIMES. 3 Hang
IV68132 81469 JIT Compiler JAVA JIT – MERGING BOUND-CHECKS CAN PREVENT CODE FROM BEING EXECUTED. 3 Unexpected Behaviour
IV71718 88588 JIT Compiler JAVA JIT- SIGSEGV OR NULLPOINTEREXCEPTION 3 Unexpected Behaviour
IV67555 80221 JIT Compiler JAVA JIT – UNSYNCHRONIZED USED OF ARRAYLIST LEADS TO A CRASH 3 Crash
IV61405 65992 JIT Compiler JIT COMPILER CRASHES DURING METHOD COMPILATION WITH A DIVIDE BY ZERO ERROR 3 Crash
IV72637 73781 JIT Compiler JIT CRASH WHILE COMPILING STRINGCODING.DECODE() OR ITS CALLER DUE TO PROBLEM REDUCING CHARACTER CONVERSION METHOD TO INTRINSIC 3 Crash
IV72529 67405 JIT Compiler JVM CRASHES IN A METHOD WITH A CALL TO COM/IBM/DATAACCESS/DECIM ALDATA.CONVERTPACKEDDECI MALTOINTEGER 3 Crash
IV72527 81406 JIT Compiler JVM CRASHES WHILE COMPILING A METHOD CALLING A DATA ACCESS ACCELERATOR API 3 Crash
IV72275 81734 JIT Compiler JVM CRASHES WITH VMSTATE=0X00040000 3 Crash
IV72477 81678 JIT Compiler JVM CRASH RUNNING IN VM STATE 0X00000000 WITH -XNOCOMPRESSEDREFS AND -XNOQUICKSTART 3 Crash
IV68296 73892 JIT Compiler MISSING RELOCATION IN AOT-COMPILED METHOD CAUSES JVM TO CRASH 3 Crash
IV72648 81732 JIT Compiler NPE AND AIOB IN ORG.ECLIPSE.JDT TEST 3 Exception Thrown
IV72276 80678 JIT Compiler OUT-OF-MEMORY CONDITION DUE TO INCORRECTLY GENERATED AOT CODE 3 Out of Memory
IV69419 84701 JIT Compiler POTENTIAL PERFORMANCE ISSUE IN USING JAVA.MATH.BIGINTEGER 3 Performance
IV72638 66271 JIT Compiler PROGRAM HANGS ON X86 32-BIT PLATFORM 3 Hang
IV72386 81630 JIT Compiler RUNNING INVOKEDYNAMIC BYTECODES IN DEBUG (JVMTI) SCENARIOS CAN OCCASIONALLY CAUSE A CRASH 3 Crash
IV72271 73459 JIT Compiler SEGMENTATION ERROR: FAILED TO FIND J2I THUNK 3 Crash
IV72272 67069 JIT Compiler SEGMENTATION ERROR VALUE PROPAGATION 3 Crash
IV72277 80675 JIT Compiler SEGMENTATION ERROR WITH VMSTATE 0X00051FFF IN COPY PROPAGATION DURING COMPILATION 3 Crash
IV72268 76210 JIT Compiler THE JVM MAY DEADLOCK DURING THE GENERATION OF DIAGNOSTIC FILES AS A CONSEQUENCE OF A CRASH 3 Hang
IV72636 77919 JIT Compiler UNEXPECTED ‘JAVA.LANG.NULLPOINTEREX CEPTION’ 3 Exception Thrown
IV66186 76918 JIT Compiler UNNECESSARY RECOMPILATION OF AOT LOADED METHODS 3 Performance
IV72681 73713 JIT Compiler UTF8 BYTE TO STRING DECODING IN JIT RESULTS IN INCORRECT VALUE WHEN THE BYTES CONTAIN SURROGATE VALUES 3 Crash
IV72217 72673 JIT Compiler VERY LARGE METHODS MAY BE MISCOMPILED ON POWERPC PLATFORMS 3 Crash
IV70617 85035 JIT Compiler X86 SEGMENTATION ERROR VMSTATE=0X0005FF08 3 Exception Thrown
IX90157 81956 ORB ERROR IN DE-SERIALIZATION OF ENUM TYPE IN EJB 3
IX90159 85537 ORB IN CASE OF GIOP VERSION MISMATCH COMM_FAILURE MAY BE THROWN FOR FORWARD REQUEST MESSAGE. 3 Exception Thrown
IX90161 87938 ORB RETRIEVAL/REMOVAL OPERATIONS ON A HASHMAP OF ORG.OMG.CORBA.PORTABLE.O BJECTIMPL MAY BEHAVE INCORRECTLY. 3 Unexpected Behaviour
IV71535 87530 Reliability and Serviceability CRASH WHEN WRITING JAVACORE DUMP WITH LARGE NUMBER OF THREADS 3 Crash
IV68689 81717 Reliability and Serviceability CRASH WHILE WRITING A JAVACORE DUMP, WHEN RUNNING A LARGE NUMBER OF JAVA THREADS 3 Crash
IV71079 82194 Reliability and Serviceability FAILURE IN JAVACORE GC HISTORY SECTION 3 Functional Issue
IV71385 60059 Reliability and Serviceability HANG WHEN PRODUCING JAVACORE DUMP ON THREAD START OR STOP EVENTS ON WINDOWS 3 Hang
IV68762 82948 Service, Build, Packaging and Delivery ADDITION OF 64-BIT LIBJVM.SO INTO THE VIRTUALPACKAGE INFORMATION IN RPM INSTALLER 3 Packaging
IV70443 86329 Service, Build, Packaging and Delivery SDK INSTALL ANYWHERE PACKAGE IN SILENT INSTALL MODE SHOULD ASK USER TO ACCEPT LICENSE AGREEMENT 3 Packaging
IV72647 85193 Service, Build, Packaging and Delivery TYPO IN .DEB CONTROL FILE 3 Packaging
IV69290 84714 Security AES-GCM IN IBMPKCS11IMPL IS CHOSEN EVEN THOUGH IT’S NOT ENABLED IN IBMPKCS11IMPL 3 Security Vulnerability
IV70544 85846 Security CIPHERSPI CALLED ENGINEUPDATE() WHICH IS NOT SUPPORTED FOR AES/GCM 3
IV72097 88031 Security ENCRYPTION TYPE ‘AES128-CTS’ CANNOT BE RECOGNIZED. 3 Unexpected Behaviour
IV71019 87588 Security FAILURE OF ‘KEYTOOL -GENKEYPAIR’ WHILE CREATING EC KEYS WITH THE PKCS11IMPLKS 3
IV71743 85070 Security IBMPKCS11IMPL – ‘OBJECT HANDLE IS INVALID’ EXCEPTION 3 Unexpected Behaviour
IV71143 87767 Security IBMPKCS11IMPL – AES/ECB SERVICE CHOSEN WHEN AES/GCM SPECIFIED 3 Unexpected Behaviour
IV70495 85270 Security IBMPKCS11IMPL SECURITY PROVIDER: ‘AES’ CAUSES COM.IBM.PKCS11.PKCS11EXC EPTION: MECHANISM INVALID 3 Unexpected Behaviour
IV71425 88352 Security IKEYMAN/CAPICMD DISCREPANCY & REVIEW CA CERTS INCLUDED IN IKEYMAN & IKEYMAN PROBLEM WITH REISSUED/MULIPATH CERTS 3
IV71427 88343 Security IKEYMAN VALIDATION FAILED DESPITE KEYS BEING PRESENT (PROBLEM 1) AND REVIEW CA CERTS INCLUDED IN IKEYMAN (PROBLEM 2) 3
IV69375 85078 Security IMPLEMENT RSAPSS SIGNATURE ALGORITHM 3
IV71562 88078 Security JGSS CANNOT GET KDC FROM DNS 3 Exception Thrown
IV69929 86289 Security JGSS SHOULD CHECK REALM WHEN GETTING TGT FROM CACHE 3 Unexpected Behaviour
IV68742 82553 Security MESSAGEDIGEST.CLOSE() RETURNS INCOMPLETE CLONE FOR SHA-1 3 Unexpected Behaviour
IV68282 82450 Security MISCELLANEOUS PKCS11KEYSTORE FIXES 3 Functional Issue
IV68818 78936 Security PKCS11IMPL: AES ALGORITHMPARAMETERS ALLOWS 8 BYTE IV 3 Unexpected Behaviour
IV68073 81891 Security RANDOM NUMBER GENERATED BY SHA1PRNG MAY NOT BE UNIQUE IN HIGHLY STRESSED ENVIRONMENT 3 Functional Issue
IV71772 87610 Security REDUNDANT NAMESPACE ADDED IN C14N CANONICALIZATION 3 Functional Issue
IV68572 83185 Security SVN CI IBMSECURITY_60_20150114 -M ‘+JAZZ-83186 DEBUG UPDATES TO PKCS11KEYSTORE.JAVA’ 3
IV68448 81587 Security TO INCLUDE LATEST TRANSLATION FILES 3
IV69557 85421 Security USE INTERNAL TOKEN FOR RSA DECRYPTION WITH ZEROPADDING 3 Exception Thrown

7.1 Service Refresh 2 Fix Pack 10

Technote for this SR/FP

APAR Defect Component Oracle Bug ID Abstract SR FP Defect Type
New Features/Enhancements
IV68040 80157 Class Libraries TIMEZONE UPGRADE TO LATEST LEVEL – TZDATA2014J 2 10
IV67656 80511 Class Libraries UPDATE CACERTS TO INCLUDE CERTIFICATES FROM AFFIRMTRUST AND CHUNGHWA TELECOM 2 10 Standards Noncompliance
IV64961 74393 Service, Build, Packaging and Delivery MAKE IBM JDK INSTALLABLE USING RHEL ANACONDA INSTALLER 2 10 Packaging
IV68808 77253 Security Support for security property jdk.tls.disabledAlgorith ms added. 2 10 Security Vulnerability
Defect Fixes
IV67421 54984 Class Libraries ‘JAVA -VERSION:1.7.1 -VERSION’ FAILS WITH JAVA7 ON LINUX PPC 32 2 10 Unexpected Behaviour
IV68748 83492 Class Libraries BACKPORT MULTI-TENANCY FEATURE FROM 8.0 TO 7.1 2 10 Functional Issue
IV67833 81301 Class Libraries CRASH IN JAVA.UTIL.TIMEZONE.GETDE FAULT() WHEN /USR/SHARE/ZONEINFO IS MISSING AFTER APPLYING APAR IV62595 2 10 Crash
IV68381 79417 Class Libraries FIX FOR JAVA/IO/OUTPUTSTREAMWRIT ER.JAVA TO ELIMINATE UNNECESSARY CALLS TO IMPROVE PERFORMANCE 2 10 Performance
IV68815 77044 Class Libraries FIX SECURITY VULNERABILITY CVE-2014-6585 2 10 Security Vulnerability
IV68810 77024 Class Libraries FIX SECURITY VULNERABILITY CVE-2014-6587 2 10 Security Vulnerability
IV68813 77037 Class Libraries FIX SECURITY VULNERABILITY CVE-2014-6591 2 10 Security Vulnerability
IV68807 77018 Class Libraries FIX SECURITY VULNERABILITY CVE-2015-0400 2 10 Security Vulnerability
IV68801 76985 Class Libraries FIX SECURITY VULNERABILITY CVE-2015-0403 2 10 Security Vulnerability
IV68802 76991 Class Libraries FIX SECURITY VULNERABILITY CVE-2015-0406 2 10 Security Vulnerability
IV68805 77011 Class Libraries FIX SECURITY VULNERABILITY CVE-2015-0407 2 10 Security Vulnerability
IV68796 76964 Class Libraries FIX SECURITY VULNERABILITY CVE-2015-0408 2 10 Security Vulnerability
IV68798 76971 Class Libraries FIX SECURITY VULNERABILITY CVE-2015-0412 2 10 Security Vulnerability
IV65046 74927 Class Libraries GETLOCALSOCKETADDRESS, GETLOCALPORT RETURNS INVALID ARGUMENT.PORTING IV03462 TO JAVA 7 2 10 Exception Thrown
IV67065 79224 Class Libraries INCORRECT DISPLAY OF GB18030 CHARACTERS ON RHEL 6 2 10 Functional Issue
IV66149 77180 Class Libraries INPUTMETHOD ON PLUGIN GOT NULLPOINTEREXCEPTION 2 10 Exception Thrown
IV66102 76760 Class Libraries IOEXCEPTION WHILE INITIALIZING SELECTOR IMPLEMENTATION IN IPV6 ONLY SYSTEM 2 10
IV66462 78059 Class Libraries JAVA.LANG.ARRAYINDEXOUTO FBOUNDSEXCEPTION WHILE ITERATING THROUGH THE EMPTY JAVA.UTIL.HASHTABLE AFTER DE-SERIALIZATION 2 10 Unexpected Behaviour
IV66900 78269 Class Libraries JDK PRODUCES INCORRECT TIME STAMPS FOR NEW RUSSIAN TIMEZONES ON WINDOWS 2 10 Functional Issue
IV68654 77530 Class Libraries MAKE JDK LIBRARIES LIBT2K.SO, LIBJSDT.SO ZAAP ENABLED ON ZOS PLATFORM 2 10 Unexpected Behaviour
IV66101 80606 Class Libraries NATIVE MEMORY LEAK WHEN CALLING NETWORKINTERFACE.GETHARD WAREADDRESS(), ISUP() AND ISLOOPBACK() 2 10 Out of Memory
IV66984 76440 Class Libraries OPTION TO DISABLE ALTPROCESSOR FEATURE FOR NON-WINDOWS LOOKANDFEEL 2 10 Functional Issue
IV66464 78148 Class Libraries REDUCE JAVA HEAP MEMORY USAGE FOR JAVA COLLECTIONS 2 10
IV68416 73496 Class Libraries REMOVE ORACLE SECURITY CLASSES FOR JAVA7 2 10 Security Vulnerability
IV66819 77839 Class Libraries SUPPORT EBCDIC CODE PAGE IBM-1377 WITH HKSCS-2008 SUPPORT 2 10
IV67429 78867 Class Libraries SWING POPUP MENU ITEM NAMES ARE NOT VISIBLE WHEN HOVERING MOUSE OVER MENU ITEMS WITH GTKLOOKANDFEEL ON RHEL 7 PLATFORM 2 10 Functional Issue
IV67302 77440 Class Libraries UNICODE SURROGATE PAIR CHARACTERS ENCODE WRONGLY 2 10 Unexpected Behaviour
IV67333 79104 Java Virtual Machine ABEND 4083 DURING JVM SHUTDOWN ON Z/OS 2 10 Crash
IV66375 77816 Java Virtual Machine A JAVA.LANG.VERIFYERROR OCCURS WHEN LOADING AN INSTRUMENTED CLASS AFTER APPLYING APAR IV62716. 2 10 Exception Thrown
IV66281 76515 Java Virtual Machine FAILED TO LOAD JRE\BIN\CLASSIC\JVM.DLL OR JRE\BIN\J9VM\JVM.DLL IN WINDOWS 2 10 Functional Issue
IV67574 79247 Java Virtual Machine FAILED TO LOAD MSVCP100.DLL AND/OR MSVCR100.DLL WHEN RUNNING HEALTH CENTER 3.0 ON WINDOWS 2 10 Functional Issue
IV67316 76902 Java Virtual Machine FINAL -XCHECK:MEMORY REPORT SUPPRESSED BY PRESENCE OF DAEMON THREADS 2 10 Unexpected Behaviour
IV68794 76960 Java Virtual Machine FIX SECURITY VULNERABILITY CVE-2014-6549 2 10 Security Vulnerability
IV68823 78139 Java Virtual Machine FIX SECURITY VULNERABILITY CVE-2014-8891 2 10 Unexpected Behaviour
IV68825 78569 Java Virtual Machine FIX SECURITY VULNERABILITY CVE-2014-8892 2 10 Security Vulnerability
IV67824 81604 Java Virtual Machine IF CERTAIN METHODS OF CUDA4J ARE THE FIRST USE OF CUDA4J BY AN APPLICATION AN EXCEPTION IS THROWN 2 10
IV66944 78947 Java Virtual Machine ILLEGALACCESSERROR THROWN WHEN RESOLVING PROTECTED METHOD DEFINED IN ANOTHER PACKAGE AFTER CLASS REDEFINITION OR RETRANSFORM 2 10
IV65688 75469 Java Virtual Machine JAVA WILL NOT START IF ENVIRONMENT VARIABLE JAVA_COMPILER OR IBM_MIXED_MODE_THRESHOLD HAS AN EMPTY VALUE 2 10
IV67817 81035 Java Virtual Machine JVM CRASH IN MAPSTACK 2 10 Crash
IV67300 61234 Java Virtual Machine JVM HANGS IF JVMTI CAN_GENERATE_COMPILED_ME THOD_LOAD_EVENTS CAPABILITY IS USED 2 10 Hang
IV67820 74364 Java Virtual Machine JVM MAY CRASH WHEN -XDUMP:EVENTS=CATCH IS USED 2 10 Crash
IV67003 76107 Java Virtual Machine LOCK CONTENTION CAUSES POOR PERFORMANCE FOR CLASS.GETANNOTATIONS 2 10 Performance
IV67287 80030 Java Virtual Machine ON LINUX JDWP SOCKET FAILS TO INITIALIZE WITH ERROR CODE -247 2 10 Usability
IV67821 79909 Java Virtual Machine ON Z/OS JVM FAILS TO REMOVE SHARED MEMORY OF A SHARED CACHE CREATED BY A JVM OF DIFFERENT ADDRESSING MODE WHEN RUNNING -XSHARECL 2 10 Functional Issue
IV67767 78757 Java Virtual Machine OPERATINGSYSTEMMXBEAN.GE TPROCESSCPULOAD() RETURNS INCORRECT VALUE WHEN USING 32-BIT JVM 2 10 Functional Issue
IV67826 81599 Java Virtual Machine PASSING FLOAT OR DOUBLE TYPES TO KERNELS SHOULD PRESERVE NAN VALUES 2 10
IV67699 80128 Java Virtual Machine POSSIBLE MEMORY LEAK IN CUDA4J 2 10 Functional Issue
IV67698 78055 Java Virtual Machine POSSIBLE NATIVE MEMORY LEAKS IN CUDA4J 2 10 Functional Issue
IV67651 78003 Java Virtual Machine SECURITYMANAGER.CHECKACC ESS() WAS CALLED WHEN A THREAD INTERRUPTED ITSELF 2 10 Exception Thrown
IV67531 76412 Java Virtual Machine SOME J9FILE TRACEPOINTS MIGHT PRINT WRONG VALUES 2 10 Usability
IV66449 77464 Java Virtual Machine SYSTEM PROPERTY ‘OS.NAME’ AND ‘OS.VERSION’ INCORRECT FOR WINDOWS SERVER 2012 R2 AND FOR WINDOWS 8.1 2 10 Functional Issue
IV67533 78782 Java Virtual Machine UNABLE TO DE-SERIALIZE METHODTYPE 2 10 Functional Issue
IV67652 79800 Java Virtual Machine UNHELPFUL ERROR CODE IS SHOWN IF SOCKET BIND FAILS. 2 10
IV68380 79711 JIT Compiler AN ILLEGAL INSTRUCTION EXCEPTION CRASH IS SEEN DURING THE RUN OF A JAVA APPLICATION 2 10 Exception Thrown
IV66036 74978 JIT Compiler ARITHMETIC DIVIDE BY ZERO EXCEPTION CAUSED BY INCORRECT LOOP VERSIONING 2 10 Exception Thrown
IV68382 81269 JIT Compiler COM/IBM/DATAACCESS/DECIM ALDATA.CONVERTINTEGERTOE XTERNALDECIMAL RETURNS INCORRECT RESULTS 2 10 Functional Issue
IV67246 78067 JIT Compiler CRASH OR NULLPOINTEREXCEPTION IN COM/IBM/JTC/JAX/XML/BIND /V2/RUNTIME/JAXBCONTEXTI MPL.GETTYPEINFOSET 2 10 Crash
IV65233 72677 JIT Compiler GPF IN THE JIT COMPILER 2 10 Crash
IV66818 77584 JIT Compiler INCORRECT BYTE TO CHARACTER CONVERSION 2 10 Exception Thrown
IV67534 78765 JIT Compiler INCORRECT OPTIMIZATION IN JIT CAUSES APPLICATION ERROR 2 10 Exception Thrown
IV68348 78700 JIT Compiler J2C LIBRARY THROWS A JAVA.LANG.ILLEGALARGUMEN TEXCEPTION WITH MESSAGE ‘INVALID INPUT SIGN’ ON UNINITIALIZED DATA 2 10 Exception Thrown
IV65284 68092 JIT Compiler JAVA CRASH/ASSERT IN GC WITH BAD O-SLOT 2 10 Crash
IV68347 69252 JIT Compiler JAVA CRASH IN COMPILED CODE 2 10 Crash
IV65517 80207 JIT Compiler PERFORMANCE REGRESSION IN JAVA 7.1 FOR POWER AIX AND POWER LINUX 2 10 Performance
IV66608 75546 JIT Compiler SEGMENTATION ERROR IN THE LIBJ9JIT DLL, VMSTATE=0X000537FF 2 10
IV67304 76541 JIT Compiler SIGFPE OR ABEND DUE TO DIVISION BY ZERO IN JAVA JIT COMPILER 2 10 Crash
IV67220 77487 JIT Compiler SMALL (2-3%) PERFORMANCE REGRESSION IN JAVA SDK 7.1 WHEN RUNNING ON SYSTEMS WITH 2 CORES OR LESS 2 10
IX90158 60615 ORB NAMESERVER BIND FAILS ON AN IPV6 ENABLED ETHERNET INTERFACE 2 10 Functional Issue
IX90156 76668 ORB OUTOFMEMORYERROR THROWN FROM CDRREADER.READBYTESFORST RING 2 10 Out of Memory
IV66662 78101 Reliability and Serviceability HANG IN NATIVE STACK COLLECTION GENERATING JAVACORE ON AIX 2 10 Hang
IV67532 77615 Reliability and Serviceability JVMTRCE000E ISSUED WHEN SETTING TRACE OPTIONS AT RUN TIME. 2 10 Exception Thrown
IV67654 80374 Reliability and Serviceability LINUX CORE DUMP MISSING HEAP MEMORY WHEN USING HUGE PAGES 2 10
IV66902 79196 Security CMS PROVIDER 2.50 CAN NOT READ SOME OLD KEY STORES 2 10
IV67593 79928 Security EXCEPTION WHILE PERFORMING A SETKEYENTRY( ) UPON A PKCS11 KEYSTORE 2 10 Exception Thrown
IV66661 76341 Security EXCLUSIVE XML CANONICALIZATION SHOWS UNEXPECTED NAMESPACE. 2 10 Unexpected Behaviour
IV66110 76936 Security FIX SECURITY VULNERABILITY CVE-2014-3566 2 10 Security Vulnerability
IV68811 77030 Security FIX SECURITY VULNERABILITY CVE-2014-6593 2 10 Security Vulnerability
IV68803 77004 Security FIX SECURITY VULNERABILITY CVE-2015-0410 2 10 Security Vulnerability
IV66609 78488 Security IBMCE AES-GCM CIPHER HAS UNEXPECTED BEHAVIOR 2 10 Unexpected Behaviour
IV68598 74525 Security INTERNALERROR WHEN SETNEEDCLIENTAUTH SET TO TRUE 2 10
IV67765 80540 Security ISSUE FOR NEGATIVE BYTE MAJOR RECORD VERSION 2 10 Unexpected Behaviour
IV68753 73380 Security JCE CIPHER.UPDATE() IS NOT COPY SAFE 2 10 Security Vulnerability
IV66522 78275 Security KEY SELECTION IN KRB5CONTEXT DOES NOT FOLLOW KERBEROS SPEC. 2 10 Unexpected Behaviour
IV68087 73456 Security LINUXPRINCIPAL ON X86 LINUX SHOULD BE DEPRECATED 2 10 Standards Noncompliance
IV65940 76691 Security PKCS11KEYSTORE.GETCERTIF ICATECHAIN() ENTIRE CHAIN NOT RETURNED 2 10 Functional Issue
IV66820 78494 Security PKCS11KEYSTORE GOES INTO AN INFINITE LOOP WHEN DELETING A PRIVATE KEY WITH COMMON SIGNER CERTIFICATE 2 10 Functional Issue
IV67882 81476 Security PKCS11KEYSTORE – OBJECT HANDLE IS INVALID EXCEPTION 2 10 Exception Thrown
IV66903 79182 Security SOME NEW FEATURES AND A FEW BUGS FIX 2 10
IV66521 78085 Security SPNEGO SHOULD SUPPORT DEFAULT_LIFETIME. 2 10 Unexpected Behaviour
IV67659 81046 Security TO INCLUDE LATEST TRANSLATION FILES 2 10
IV67133 79826 XML CDATA SECTION GETS SPLIT UP UNEXPECTEDLY IN RESULT DOCUMENT 2 10 Unexpected Behaviour
PI27203 76833 z/OS Extentions JZOS DOES NOT RAISE EXCEPTION WHEN D37 ABEND IS ENCOUNTERED 2 10 Unexpected Behaviour

7.1 Service Refresh 2

Technote for this SR/FP

APAR Defect Component Oracle Bug ID Abstract SR FP Defect Type
New Features/Enhancements
IV65399 73329 Class Libraries ADD BACK TRACE FORMAT FILES FOR RAS 2 Functional Issue
IV65132 68950 Class Libraries NEW JAVA SYSTEM PROPERTY TO DISABLE UPDATED HASHING ALGORITHM. 2 Unexpected Behaviour
IV65395 68546 Class Libraries UPDATE CACERTS TO INCLUDE NEW VERISIGN INTERMEDIATE CA CERTIFICATE 2 Standards Noncompliance
IV66565 78561 Class Libraries UPDATE IBM JDK 7 CLASS LIBRARIES TOORACLE JDK 7 U71 LEVEL 2
IV65368 71898 Class Libraries UPDATE TIMEZONE INFORMATION TO TZDATA2014G 2
IV64492 73356 Security ENHANCE IBM PKCS12 KEYSTORE 2 Security Vulnerability
PI28844 78250 z/OS Extentions JZOS API FOR USS FILE ATTRIBUTES SUPPORT 2
PI28842 78252 z/OS Extentions JZOS JES SYMBOL SUPPORT 2
PI28843 78251 z/OS Extentions JZOS LAUNCHER JMX BASED SMF PERFORMANCE LOGGING 2
Defect Fixes
IV64490 73521 Class Libraries BIGINTEGER.MODINVERSE RETURNS BIGINTEGER OBJECTS WITH NON-CANONICAL INTERNAL REPRESENTATION 2 Functional Issue
IV65996 70567 Class Libraries FIX SECURITY VULNERABILITY CVE-2014-4288 2 Security Vulnerability
IV65993 70551 Class Libraries FIX SECURITY VULNERABILITY CVE-2014-6456 2 Security Vulnerability
IV65999 70585 Class Libraries FIX SECURITY VULNERABILITY CVE-2014-6458 2 Security Vulnerability
IV66000 72863 Class Libraries FIX SECURITY VULNERABILITY CVE-2014-6466 2 Security Vulnerability
IV66004 70598 Class Libraries FIX SECURITY VULNERABILITY CVE-2014-6476 2 Security Vulnerability
IV65998 70579 Class Libraries FIX SECURITY VULNERABILITY CVE-2014-6492 2 Security Vulnerability
IV65997 70573 Class Libraries FIX SECURITY VULNERABILITY CVE-2014-6493 2 Security Vulnerability
IV66020 70659 Class Libraries FIX SECURITY VULNERABILITY CVE-2014-6502 2 Security Vulnerability
IV65994 70555 Class Libraries FIX SECURITY VULNERABILITY CVE-2014-6503 2 Security Vulnerability
IV66001 70591 Class Libraries FIX SECURITY VULNERABILITY CVE-2014-6506 2 Security Vulnerability
IV66008 70614 Class Libraries FIX SECURITY VULNERABILITY CVE-2014-6511 2 Security Vulnerability
IV66015 70641 Class Libraries FIX SECURITY VULNERABILITY CVE-2014-6512 2 Security Vulnerability
IV65992 70539 Class Libraries FIX SECURITY VULNERABILITY CVE-2014-6513 2 Security Vulnerability
IV66006 70604 Class Libraries FIX SECURITY VULNERABILITY CVE-2014-6515 2 Security Vulnerability
IV66019 70655 Class Libraries FIX SECURITY VULNERABILITY CVE-2014-6527 2 Security Vulnerability
IV66012 70634 Class Libraries FIX SECURITY VULNERABILITY CVE-2014-6531 2 Security Vulnerability
IV65995 70561 Class Libraries FIX SECURITY VULNERABILITY CVE-2014-6532 2 Security Vulnerability
IV62950 70397 Class Libraries FOCUS GOES TO GRANDPARENT WHEN MODAL JDIALOG DISPOSE ON JDIALOG 2 Unexpected Behaviour
IV65398 71882 Class Libraries GENERAL PATCH FOR EXTENDEDCHARSETS.JAVA TO REMOVE SMALL FOOTPRINT JRE SPECIFIC PATCH 2 Functional Issue
IV65394 68837 Class Libraries HASHTABLE.REMOVE() DOES NOT THROW NULLPOINTEREXCEPTION WHEN PARAMETER KEY IS NULL. 2 Standards Noncompliance
IV65245 69354 Class Libraries INTERMITTENT CORRUPTED DOUBLE-LINKED LIST CRASH IN LINUX PPC WHILE RUNNING IBM ORB REMOTE MARSHALLING TEST WITH RDMA ENABLED 2 Crash
IV62978 70043 Class Libraries JAVA.NET.INETADDRESS.GET ALLBYNAME(STRING HOST) DOES NOT RETURN BOTH IPV4 AND IPV6 ADDDRESSES ON ZOS PLATFORM 2 Unexpected Behaviour
IV65234 74074 Class Libraries JAVA KEEPS X-WINDOW’S MEMORY IF XRENDER IS ENABLED 2 Out of Memory
IV62595 70060 Class Libraries JDK RETURNS TZ ID IN GMT-/+XX:XX FORMAT FOR SOME OLSON TIMEZONES 2
IV65244 64149 Class Libraries JTREG TEST COM/ORACLE/NET/SANITY.JA VA FAILS 2 Exception Thrown
IV63748 71587 Class Libraries METHODS JAVA.IO.FILE.GETXXXSPACE () WRONGLY RETURN 0 2 Functional Issue
IV62236 69309 Class Libraries NATIVE MEMORY LEAK WITH RUNTIME.EXEC AFTER APPLYING APAR IV65817 2 Out of Memory
IV65393 66447 Class Libraries NON-FOCUSABLE WINDOW POSITION IS CHANGED BY REMAP ON AIX 2 Unexpected Behaviour
IV65400 74211 Class Libraries SFJ: ADD BACK IBMPKCS11IMPL.JAR 2
IV63135 71430 Class Libraries SIGILL WITH CUSTOM JVM LAUNCHERS ON AIX AFTER APPLYING APAR IV68748 2 Crash
IV64074 73397 Class Libraries UNEXPECTED OCCURRENCES OF JAVA.NET.SOCKETEXCEPTION AFTER APPLYING IV69000 2 Exception Thrown
IV65477 72492 Java Virtual Machine A JAVA.SECURITY.ACCESSCONT ROLEXCEPTION IS THROWN DUE TO A DOMAIN FAILED (JAVA.SECURITY.SECURITYP ERMISSION CREATEACCESSCONTROLCON 2 Unexpected Behaviour
IV64749 66115 Java Virtual Machine ASSERTION FAILURE DURING JVM STARTUP WHEN USING AN EXISTING SHARED CLASS CACHE WITH -XSHARECLASSES OPTION 2 Crash
IV63994 72445 Java Virtual Machine ASSERTION FAILURE OR SEGMENTATION FAULT OCCURS INTERMITTENTLY DURING J9HEAP ALLOCATION 2 Crash
IV65161 67626 Java Virtual Machine BOOTSTRAPMETHODERROR FROM BOOTCLASS PATH 2 Exception Thrown
IV65434 68323 Java Virtual Machine CONSTANTPOOL RESOLUTION OF JAVA.LANG.INVOKE.METHODH ANDLE INVOKEEXACT() AND INVOKE() FAILS WITH NOSUCHMETHODERRROR 2 Exception Thrown
IV61966 63068 Java Virtual Machine CRASHES AND ASSERTS WITH LARGE CUSTOMIZED TLHMINIMUMSIZE 2 Crash
IV66044 66336 Java Virtual Machine FIX SECURITY VULNERABILITY CVE-2014-3065 2 Security Vulnerability
IV65160 66343 Java Virtual Machine GC ASSERTION/CRASH DURING JVM STARTUP 2 Functional Issue
IV62298 68131 Java Virtual Machine INCOMPATIBLECLASSCHANGEE RROR OCCURS WHEN JAVA.LANG.CLASS.GETDECLA RINGCLASS() IS CALLED 2
IV65151 65642 Java Virtual Machine INCORRECT ERROR MESSAGE WHEN JVM FAILS TO CREATE SEMAPHORE SET OR SHARED MEMORY FOR THE SHARED CLASS CACHE DUE TO INSUFFICIENT R 2
IV65188 61237 Java Virtual Machine INTERFACES CAN INCORRECTLY BE IMPLEMENTED WITH NON-PUBLIC METHODS 2
IV65884 66949 Java Virtual Machine INTERNALERROR FROM ZIPFILE.GETCOMMENT() WITH -XZERO 2 Exception Thrown
IV62714 68087 Java Virtual Machine JAVA VM CRASHES ON CLASS FILES WITH MALFORMED ANNOTATION ATTRIBUTES 2 Crash
IV63654 70092 Java Virtual Machine JVM fails to start up with non-persistent shared class cache after system reboot or IPL 2 Unexpected Behaviour
IV65162 67335 Java Virtual Machine JVM HANGS AFTER REPLACING A CLASS AFTER APPLYING APAR IV19637 2 Hang
IV65164 70896 Java Virtual Machine LOOKUP OBJECT WITH INCORRECT ACCESS CLASS 2 Security Vulnerability
IV65187 68356 Java Virtual Machine METHODHANDLE ACCESS CHECKING INCORRECTLY HANDLED PROTECTED ACCESS 2 Exception Thrown
IV65163 68756 Java Virtual Machine STRINGBUFFER WAS NOT THREAD-SAFE 2 Exception Thrown
IV65165 73349 Java Virtual Machine TAIL PADDING REQUESTED BY -XAGGRESSIVE PREVENTS HEAP ALLOCATION BELOW BAR 2 Functional Issue
IV64780 73143 Java Virtual Machine THE IMPLEMENTATION OF PARALLEL CLASS LOADING DISCARDS CLASS LOADING LOCKS 2 Functional Issue
IV59052 63504 Java Virtual Machine UNABLE TO START JAVA VIRTUAL MACHINE DUE TO MISSING LIBSTDC++.SO.5 ON ZLINUX 2 Functional Issue
IV74978 70779 Java Virtual Machine UNDOCUMENTED CHANGE 2 Security Vulnerability
IV65130 68001 JIT Compiler APPLICATION CRASHED ON X86 DUE TO LARGE NUMBER OF REGISTER DEPENDENCIES 2 Crash
IV63382 71337 JIT Compiler BACKWARD ARRAY COPYING FAILS TO COPY THE LAST BYTE IN THE SOURCE ARRAY 2 Functional Issue
IV65326 66564 JIT Compiler CRASH IN GC MODULE BECAUSE OF INCORRECT REGISTER ALLOCATION 2 Crash
IV65885 70922 JIT Compiler CRASH IN TR_VALUEPROPAGATION WITH -XSHARECLASSES 2 Crash
IV65771 67978 JIT Compiler HANG IN COMPILATION THREAD IN ORDERBLOCKS 2 Hang
IV64048 71554 JIT Compiler INCORRECT RESULT WHEN COPYING ARRAY ELEMENTS BETWEEN OVERLAPPING SOURCE AND DESTINATION SUBRANGES IN A SINGLE JAVA ARRAY ON X86 2 Exception Thrown
IV65516 73732 JIT Compiler JAVA 7.1 SR1 JIT MAY CRASH ON 64-BIT AIX POWER8 2 Unexpected Behaviour
IV65519 75501 JIT Compiler JAVA 7.1SR1 JIT SIGILL CRASH ON AIX WHEN RUNNING ON POWER8 2 Crash
IV62523 64933 JIT Compiler JAVA CRASH IN THE JIT DURING AOT COMPILATIONS 2 Crash
IV58762 63487 JIT Compiler JAVA PROCESS HANGS DURING GARBAGE COLLECTION WHEN A JIT-COMPILED METHOD HAS A VERY LARGE STACK FRAME 2 Hang
IV63802 72702 JIT Compiler JIT-COMPILED METHOD WITH DIVISION OR MODULO RETURNS INCORRECT RESULT 2 Functional Issue
IV63027 59411 JIT Compiler JIT COMPILER CRASHES DURING COMPILATION IN FULL SPEED DEBUG MODE 2 Crash
IV65518 73174 JIT Compiler JIT MAY CRASH IN LIBC STRCHR DURING COMPILATION 2 Crash
IV67301 73299 JIT Compiler PERFORMANCE REGRESSION IN JAVA 7.1 FOR POWER AIX AND POWER LINUX 2
IV65285 72452 JIT Compiler SMALL (1-2%) PERFORMANCE REGRESSION IN JAVA SDK 7.1 WHEN RUNNING ON LINUX SYSTEMS WITH 2 CORES OR LESS 2 Performance
IX90151 68680 ORB EXCEPTION ORG.OMG.CORBA.OBJ_ADAPTER WITH CAUSE ORG.OMG.CORBA.ORBPACKAGE .INVALIDNAME: ROOTPOA MAY BE SEEN 2 Unexpected Behaviour
IX90133 56712 ORB FIX SECURITY VULNERABILITY CVE-2014-0428 2 Functional Issue
IX90152 72245 ORB JAVA.NET.UNKNOWNHOSTEXCE PTION THROWN FROM COM.IBM.RMI.IIOP.ORB.LOO KUPLOCALOBJECT AFTER APPLYING IX90122 2 Exception Thrown
IX90153 66891 ORB MARSHALEXCEPTION WHILE SENDING THE CODEBASE SERVICE CONTEXT 2 Exception Thrown
IX90150 69763 ORB ORB THROWS A MARSHAL EXCEPTION. 2
IX90154 71904 ORB POSSIBLE OUTOFMEMORYERRORS OR FRAGMENT TIMEOUTS WHEN CONNECTION MULTIPLICITY IS GREATER THAN 1 2 Unexpected Behaviour
IV65392 66575 Reliability and Serviceability CRASH IN GC IF -XTRACE HEAPDUMP TRIGGER SET ON TRACEPOINT J9MM.148 2 Crash
IV65397 70998 Reliability and Serviceability DTFJ API LOOP GETTING STACK SECTIONS FOR A JAVA THREAD FROM A CORE DUMP 2
IV65401 74749 Reliability and Serviceability DTFJ DUMP READER LOOPS IN CIB CHAIN WHEN OPENING ZOS SVCDUMP 2
IV65396 71547 Reliability and Serviceability JDMPVIEW FAILS TO IDENTIFY CRASHING THREAD IN A ZOS CORE DUMP 2
IV62883 66222 Reliability and Serviceability JDMPVIEW HEAPDUMP COMMAND REPORTS ERRORS 2 Functional Issue
IV65369 73253 Reliability and Serviceability NATIVE STACK INFORMATION MISSING FOR LINUX CORE DUMPS IN JDMPVIEW AND DTFJ 2
IV62678 67603 Service, Build, Packaging and Delivery SILENT INSTALL USING AN ARCHIVE BIN INSTALLANYWHERE SDK PACKAGE IGNORES USER SPECIFIED INSTALL DIRECTORY 2 Packaging
IV63984 71142 Security CIPHER.PBEWITHSHAANDTRIP LEDES FROM IBMJCE PROVIDER PRODUCING DIFFERENT RESULTS 2 Unexpected Behaviour
IV66110 76936 Security FIX SECURITY VULNERABILITY CVE-2014-3566 2 Security Vulnerability
IV66017 70648 Security FIX SECURITY VULNERABILITY CVE-2014-6457 2 Security Vulnerability
IV66023 70666 Security FIX SECURITY VULNERABILITY CVE-2014-6558 2 Security Vulnerability
IV64870 69684 Security IKEYMAN 8.0.391 2
IV64149 71948 Security IKEYMAN 8 FAILS CREATING CERTIFICATES AGAINST JAVA 8 2
IV64658 73724 Security IKEYMAN CRASHES WHEN DEALING WITH A BAD CERTIFICATE 2
IV64606 68703 Security IMPROPER / CONFUSING ERROR MESSAGE IN PKCS12 KEYSTORE LOADING 2 Usability
IV68755 73189 Security INCONCLUSIVE EXCEPTION MESSAGE FROM SSL COMPONENT 2 Usability
IV64560 72345 Security JSSE2 WITH PKCS11 RSA PREMASTER SECRET ERROR 2 Exception Thrown
IV66519 61045 Security PACKAGE JCK.RUNTIME.API.ORG_IETF IS NOT EXECUTING 2 Unexpected Behaviour
IV63804 72623 Security PKCS11 CANNOT GET THE PRIVATE KEYS INSIDE A KEYSTORE 2 Functional Issue
IV64559 69711 Security RSAFORSSL SERVICE REGISTERED WITH MECHANISM CKM_RSA_X_509 2 Exception Thrown
IV64562 71544 Security SECURITYEXCEPTION THROWN WHEN IBMPKCS11IMPL BEFORE IBMJCE 2 Exception Thrown
IV65166 74934 Security SIGNATURE VERIFY FAILURE WITH SHA*WITHECDSA ALGORITHMS 2 Functional Issue
PI19082 70828 z/OS Extentions JZOS MESSAGE TEXT INCORRECTLY SPELLS NON-DAEMON AS NON-DEAMON 2

7.1 Service Refresh 1 Fix Pack 1

Technote for this SR/FP

APAR Defect Component Oracle Bug ID Abstract SR FP Defect Type
New Features/Enhancements
IV61011 66245 Class Libraries ADD SUPPORT FOR CODE PAGE CP1165 1 1
IV62177 65278 Class Libraries JAVA (VERSION JAVA 5 / JAVA 6 / JAVA 7) TIME ZONE UPGRADE TO THE LEVEL 2014E 1 1
IV61010 64138 Class Libraries THREE TIME ZONE FILES NOT REQUIRED SINCE JAVA 7 SR6-FP1 ARE ADDED BACK IN SR7 1 1
IV62686 70480 Class Libraries UPDATE IBM JDK 7 CLASS LIBRARIES TO ORACLE JDK 7 U65 LEVEL 1 1
Defect Fixes
IV62988 71004 Class Libraries DEADLOCK WITH JAVA.NIO.CHARSET.CHARSET .AVAILABLECHARSETS() 1 1 Hang
IV61661 67680 Class Libraries DEFAULT NAMES OF FEW CHARSET CHANGED AFTER APPLYING APAR IV53873 1 1
IV62633 64706 Class Libraries FIX SECURITY VULNERABILITY CVE-2014-4208 1 1 Functional Issue
IV62615 64454 Class Libraries FIX SECURITY VULNERABILITY CVE-2014-4209 1 1 Functional Issue
IV62621 64469 Class Libraries FIX SECURITY VULNERABILITY CVE-2014-4218 1 1 Functional Issue
IV62617 64460 Class Libraries FIX SECURITY VULNERABILITY CVE-2014-4220 1 1 Functional Issue
IV62609 64421 Class Libraries FIX SECURITY VULNERABILITY CVE-2014-4227 1 1 Functional Issue
IV62624 64475 Class Libraries FIX SECURITY VULNERABILITY CVE-2014-4252 1 1 Functional Issue
IV62611 65109 Class Libraries FIX SECURITY VULNERABILITY CVE-2014-4262 1 1 Functional Issue
IV62627 64487 Class Libraries FIX SECURITY VULNERABILITY CVE-2014-4265 1 1 Functional Issue
IV62626 64481 Class Libraries FIX SECURITY VULNERABILITY CVE-2014-4266 1 1 Functional Issue
IV62618 64463 Class Libraries FIX SECURITY VULNERABILITY CVE-2014-4268 1 1 Functional Issue
IV58815 62627 Class Libraries HTTPURLCONNECTION DOES NOT SUPPORT AN ENTITY BODY FOR THE HTTP DELETE METHOD 1 1 Exception Thrown
IV61407 65206 Class Libraries INFINITE LOOP IN JDWP 1 1 Hang
IV60710 64294 Class Libraries JAVA CONTROL PANEL IS DISPLAYING YEAR AS ‘2013’ INSTEAD OF ‘2014’ 1 1 Usability
IV60518 64865 Class Libraries JAVA IS CRASHING ON WINDOWS WHILE OPENING A FILE WITH FILENAME CONTAINING DBCS CHARACTERS AND LENGTH MORE THAN 512 BYTES. 1 1 Crash
IV59520 63923 Class Libraries NULLPOINTEREXCEPTION WHILE WRITING CLASS DESCRIPTOR OBJECT TO OBJECTOUTPUTSTREAM AFTER APLLYING APAR IV43437. 1 1 Exception Thrown
IV60794 66261 Class Libraries TIMEZONE ENTRIES MISSING IN TZMAPPINGS FILE 1 1 Functional Issue
IV61566 66644 Class Libraries UPDATE THE ZAMBIAN CURRENCY CODE VALUE 1 1 Currency
IV62096 54690 Class Libraries Z/OS ZAAP SUPPORT FOR MISSING CLASSES JNI NATIVES 1 1 Unexpected Behaviour
IV62212 63352 Java Virtual Machine ** ASSERTION FAILED ** AT INCREMENTALGENERATIONALG C.CPP:843 1 1 Functional Issue
IV62211 63675 Java Virtual Machine CRASH WITH ASSERTION FAILED AT MGCALLOC.CPP:453 1 1 Unexpected Behaviour
IV62634 65377 Java Virtual Machine FIX SECURITY VULNERABILITY CVE-2014-3086 1 1 Security Vulnerability
IV62614 64446 Java Virtual Machine FIX SECURITY VULNERABILITY CVE-2014-4219 1 1 Security Vulnerability
IV62628 64492 Java Virtual Machine FIX SECURITY VULNERABILITY CVE-2014-4221 1 1 Functional Issue
IV60076 64624 Java Virtual Machine INCORRECT ASSERTION CAN BE OPTIONALLY ENABLED, AND IS TRIGGERED WHEN A CLASS IS BEING RETRANSFORMED 1 1 Unexpected Behaviour
IV61924 67540 Java Virtual Machine INCORRECT STATISTICS WHEN USING -XVERBOSE:GC 1 1
IV60435 64809 Java Virtual Machine MESSAGES IN OS SYSTEM LOG USE WRONG ENCODING 1 1 Usability
IV59885 61609 Java Virtual Machine MULTIPLE EXCLUSIVE ACCESS EVENTS REPORTED FOR CONCURRENT KICKOFF IN VERBOSE GC LOGS 1 1 Functional Issue
IV62210 55729 Java Virtual Machine MULTI-TENANT GC VERBOSE LOG SHOWS A HIGH PERCENTAGE OF NON-LOCAL MEMORY 1 1 Unexpected Behaviour
IV61967 61206 Java Virtual Machine NULLPOINTEREXCEPTION IN CLASS.GETDECLAREDANNOTAT IONS() AFTER CLASS REDEFINITION 1 1
IV59039 63693 Java Virtual Machine POOR RESPONSE OR APPLICATION TIMEOUT DUE TO MULTIPLE THREADS WAITING ON SHARED CACHE WRITE LOCK WHEN THE SHARED CACHE IS FULL. 1 1 Hang
IV60018 64264 Java Virtual Machine PROVIDE ERRNO2 INFORMATION WHEN THREAD CREATION FAILS ON Z/OS PLATFORMS 1 1 Out of Memory
IV61965 63572 Java Virtual Machine SEGMENTATION ERROR IN THE JIT MODULE ON 64-BIT AIX OR LINUX PPC 1 1 Crash
IV62248 64245 Java Virtual Machine TRC_MM_J9ALLOCATEINDEXAB LEOBJECT_OUTOFLINEOBJECT ALLOCATIONTRACEPOINT INCORRECTLY REPORT NUMBER OF INDEXED FIELDS 1 1 Functional Issue
IV59052 63504 Java Virtual Machine UNABLE TO START JAVA VIRTUAL MACHINE DUE TO MISSING LIBSTDC++.SO.5 ON ZLINUX 1 1 Functional Issue
IV61567 66913 Java Virtual Machine UNABLE TO USE NON-PERSISTENT SHARED CLASS CACHE WHEN RUNNING WITH -XSHARECLASSES:READONLY IF ASSOCIATED SHARED MEMORY HAS READ-O 1 1 Security Vulnerability
IV60019 64250 JIT Compiler HIGH CPU IN AOT/JIT COMPILED METHOD DUE TO LIVELOCK CONDITION 1 1 Hang
IV60711 61660 JIT Compiler ILLEGAL INSTRUCTION EXCEPTION IN JIT SHARED LIBRARY ON RHEL7 1 1 Crash
IV61564 61348 JIT Compiler INCONSISTENT STARTUP PERFORMANCE WHEN -XSHARECLASSES OPTION IS USED 1 1 Performance
IV60353 64948 JIT Compiler INCORRECT OPTIMIZATION OF VARIABLE UPDATES USING INTEGER XOR OPERATOR (“^”) 1 1 Unexpected Behaviour
IV61659 66622 JIT Compiler JAVA JIT COMPILATION THREAD NOT RELEASING CLASS TABLE LOCK CAUSING APPLICATION TO HANG 1 1 Hang
IV61405 65992 JIT Compiler JIT COMPILER CRASHES DURING METHOD COMPILATION WITH A DIVIDE BY ZERO ERROR 1 1 Crash
IV62265 56238 JIT Compiler LONG PAUSE GC IN JIT RUNTIME ASSUMPTION TABLE RECLAIM 1 1 Performance
IV60971 65353 JIT Compiler UNHANDLED EXCEPTION IN JIT SHARED LIBRARY ON RHEL7 1 1 Crash
IX90145 63826 ORB ACCORDINGLY MODIFY ORB TRACE LEVELS TO FINE, FINER & FINEST. 1 1
IX90147 66440 ORB INCORRECT CLASSNOTFOUNDEXCEPTION OR CLASSCASTEXCEPTION THROWN DUE TO INCORRECT CLASSLOADER USED. 1 1 Unexpected Behaviour
IX90149 68140 ORB ORB INITIALIZATION FAILURE IN CERTAIN APPLICATIONS 1 1 Unexpected Behaviour
IX90148 64254 ORB OUTOFMEMORYERROR THROWN FROM THE ORB CODE 1 1 Functional Issue
IX90144 63863 ORB UNEXPECTED EXCEPTION THROWN IN EJB CALL 1 1 Standards Noncompliance
IX90146 66937 ORB UPDATE IBMCFW.JAR FOR PI15755 1 1
IV61041 65941 Reliability and Serviceability MEMORY LEAK OR SIGSEGV/GPF DURING JVM SHUTDOWN 1 1 Crash
IV61088 66225 Reliability and Serviceability NO NATIVE STACKS IN WINDOWS 64 JAVACORES 1 1 Functional Issue
IV62675 63631 Service, Build, Packaging and Delivery REMOVING PRE-REQUISITE OF THE LIBSTDC++.SO.* FROM THE RPM INSTALLER. 1 1 Packaging
IV62677 67991 Service, Build, Packaging and Delivery SDK/JRE .BIN PACKAGE UNINSTALL DELETES FILES CREATED AFTER INSTALLATION. 1 1 Standards Noncompliance
IV62680 63062 Service, Build, Packaging and Delivery SDK/JRE RPM PACKAGES UNINSTALL WITH WARNING ON LINUX WITH RPM VERSION > 4.11 1 1 Packaging
IV62044 68320 Security CMS PROVIDER 2.50 CAN NOT READ SOME OLD VERSION KEYSTORES 1 1
IV66876 79139 Security FIX SECURITY VULNERABILITY CVE-2014-3068 1 1 Functional Issue
IV62631 64501 Security FIX SECURITY VULNERABILITY CVE-2014-4244 1 1 Security Vulnerability
IV62629 64495 Security FIX SECURITY VULNERABILITY CVE-2014-4263 1 1 Security Vulnerability
IV62318 68810 Security IBMPKCS11IMPL PROVIDER UPDATES FOR ‘MEMORY LEAK’ 1 1
IV60232 64986 Security JAAS LOGIN SHOULD TRY TO RETRIEVE SERVER CREDENTIAL FROM KEYTAB WHEN SERVICE NAME IS NULL 1 1 Exception Thrown
IV58752 65709 Security JGSS NO NEED TO DO COMPARISON BETWEEN MAXIMUM RECEIVE BUFFER SIZE AND COMPUTED SIZE OF MECHANISM TOKEN FOR SASL/JGSS 1 1 Hang
IV60418 63098 Security JGSS SHOULD PERFORM JAAS LOGIN AFTER FAILING TO OBTAIN CREDENTIALS FROM SUBJECT. 1 1 Unexpected Behaviour
IV60792 63103 Security JGSS SHOULD USE DEFAULT_REALM BEFORE GUESSING THE REALM FROM HOSTNAME. 1 1 Exception Thrown
IV60787 66184 Security KEYTOOL -STOREPASSWD NOT WORKING FOR PKCS12 KEYSTORE 1 1 Functional Issue
IV60519 65385 Security KINIT SHOULD PROCESS FLAGS PASSED FROM COMMAND LINE CORRECTLY IN JAVA 7.0. 1 1 Unexpected Behaviour
IV60516 64876 Security NO MAXTOKENSIZE COMPARISON NEEDED FOR SASL SERVER/CLIENT 1 1 Exception Thrown
IV62319 67913 Security PBE ALGORITHM NAMES IN THE IBMJCE PROVIDER 1 1 Functional Issue
IV61568 67848 Security SASL DIGEST-MD5 CLIENT DOES NOT USE THE NEGOTIATED QOP SUPPORTED BY SERVER 1 1 Functional Issue
IV62136 66121 Security SLOWER STARTUP TIME OBSERVED AFTER APPLYING APAR IV59570 1 1 Performance
IV60611 57051 Security XML CANONICALIZATION DOES NOT WORK AS EXPECTED. 1 1 Functional Issue

7.1 Service Refresh 1

Technote for this SR/FP

APAR Defect Component Oracle Bug ID Abstract SR FP Defect Type
New Features/Enhancements
IV58529 62624 Class Libraries ‘TRANSLATION MESSAGES UPDATE FOR JDK ‘ 1
IV65817 78939 Class Libraries UPDATE IBM JDK 7 CLASS LIBRARIES TO ORACLE JDK 7 U55 LEVEL 1
IV57723 62837 Security UPDATE IKEYMAN 8.0.389 & CMS PROVIDER 2.50 1 Security Vulnerability
Defect Fixes
IV55642 55145 Service, Build, Packaging and Deliver DEADLOCK BETWEEN LOGMANAGER CLASS INITIALIZATION LOCK AND LOGMANAGER.LOGGERCONTEXT 1 Hang
IV58642 62879 Class Libraries ADD CODE PAGE CP1166 1 Functional Issue
IV51860 54948 Class Libraries ALLOW IBM####, CP####, OR #### AS ALIAS TO IBM-#### CHARSET 1 Functional Issue
IV56130 60300 Class Libraries APPLET SECURITY WARNING CAN’T BE ACKNOWLEDGED IN CHINESE LOCALE 1 Unexpected Behaviour
IV53592 54994 Class Libraries ARRAYINDEXOUTOFBOUNDSEXC EPTION AND JAVA.LANG.EXCEPTION: MALFORMED WITH UTF-16 1 Exception Thrown
IV53591 54993 Class Libraries CANENCODE API RETURNING INVALID RESULTS FOR SOME CODE POINTS OF IBM1399A, IBM1390, IBM1390A AND IBM1399 CODEPAGES 1 Functional Issue
IV57409 61346 Class Libraries CL CHANGES FOR JIT PERFORMANCE DEGRADATION 1 Performance
IV55601 54448 Class Libraries COM.SUN.NET.SSL.INTERNAL .WWW.PROTOCOL IS BROKEN ON IBM JAVA 7 1 Exception Thrown
IV53349 54916 Class Libraries CRASH IN ZIPFILE.READ() 1 Crash
IV59011 61720 Class Libraries ENHANCEMENT TO ARABIC SHAPING ENGINE 1 Functional Issue
IV48098 55234 Class Libraries FILEOUTPUTSTREAM WITH DBCS CHARACTERS THROWS UNEXPECTED ERROR AFTER DATABASE CONNECTION ON WINDOWS PLATFORM 1 Functional Issue
IV59563 54097 Class Libraries FIX SECURITY VULNERABILITY CVE-2013-6629 1 Functional Issue
IV59562 54092 Class Libraries FIX SECURITY VULNERABILITY CVE-2013-6954 1 Crash
IV59355 54014 Class Libraries FIX SECURITY VULNERABILITY CVE-2014-0429 1 Crash
IV59506 54034 Class Libraries FIX SECURITY VULNERABILITY CVE-2014-0446 1 Functional Issue
IV59503 54028 Class Libraries FIX SECURITY VULNERABILITY CVE-2014-0448 1 Functional Issue
IV59568 54109 Class Libraries FIX SECURITY VULNERABILITY CVE-2014-0449 1 Functional Issue
IV59548 54045 Class Libraries FIX SECURITY VULNERABILITY CVE-2014-0451 1 Functional Issue
IV59547 54040 Class Libraries FIX SECURITY VULNERABILITY CVE-2014-0452 1 Functional Issue
IV59346 53997 Class Libraries FIX SECURITY VULNERABILITY CVE-2014-0457 1 Documentation
IV59554 54065 Class Libraries FIX SECURITY VULNERABILITY CVE-2014-0458 1 Functional Issue
IV59569 54117 Class Libraries FIX SECURITY VULNERABILITY CVE-2014-0459 1 Crash
IV59560 54086 Class Libraries FIX SECURITY VULNERABILITY CVE-2014-0460 1 Functional Issue
IV59491 61481 Class Libraries FIX SECURITY VULNERABILITY CVE-2014-0461 1 Functional Issue
IV59574 59042 Class Libraries FIX SECURITY VULNERABILITY CVE-2014-1876 1 Functional Issue
IV59572 54128 Class Libraries FIX SECURITY VULNERABILITY CVE-2014-2398 1 Functional Issue
IV59565 54103 Class Libraries FIX SECURITY VULNERABILITY CVE-2014-2401 1 Crash
IV59550 54051 Class Libraries FIX SECURITY VULNERABILITY CVE-2014-2402 1 Functional Issue
IV59558 54081 Class Libraries FIX SECURITY VULNERABILITY CVE-2014-2409 1 Functional Issue
IV59556 54075 Class Libraries FIX SECURITY VULNERABILITY CVE-2014-2412 1 Functional Issue
IV59555 54070 Class Libraries FIX SECURITY VULNERABILITY CVE-2014-2414 1 Functional Issue
IV59576 54134 Class Libraries FIX SECURITY VULNERABILITY CVE-2014-2420 1 Functional Issue
IV59353 54008 Class Libraries FIX SECURITY VULNERABILITY CVE-2014-2421 1 Crash
IV59551 54054 Class Libraries FIX SECURITY VULNERABILITY CVE-2014-2423 1 Functional Issue
IV59552 54059 Class Libraries FIX SECURITY VULNERABILITY CVE-2014-2427 1 Functional Issue
IV59502 54023 Class Libraries FIX SECURITY VULNERABILITY CVE-2014-2428 1 Functional Issue
IV58786 55000 Class Libraries IMPROVE THE IBM JRE’S CHECKING AND HANDLING OF EXPIRY WARNING INFORMATION IN THE DEPLOY COMPONENT 1
IV52056 56164 Class Libraries JAVA.LANG.UNSATISFIEDLIN KERROR: WHILE LOADING LIBAWT.SO LIBRARY 1 Exception Thrown
IV54123 54997 Class Libraries JAVA.NET.SOCKETEXCEPTION WITH NETWORKINTERFACE.GETNETW ORKINTERFACES() AFTER APPLYING IV51177 1 Functional Issue
IV59352 59944 Class Libraries JAVA.UTIL.ZIP.ZIPEXCEPTI ON IS THROWN WHEN COPYING JAR FILE USING PACK200 API 1 Exception Thrown
IV55037 58502 Class Libraries JAVA PLUGIN MIME TYPE TABLE CONTAINS AN EMPTY ENTRY 1 Functional Issue
IV50083 54777 Class Libraries JAVA -SHOWVERSION RESULT IN JAVA.LANG.NOSUCHMETHODER ROR ON HYBRID PLATFORMS (SOLARIS AND HP-UX) 1 Exception Thrown
IV54704 55321 Class Libraries LOCK FILES CREATED BY FILEHANDLER NOT GETTING CLEANED-UP WITH GC 1 Functional Issue
IV58706 59296 Class Libraries MTJAVA.LANG.ILLEGALMONIT ORSTATEEXCEPTION HAPPENED IN THREADPOOLEXECUTOR 1 Exception Thrown
IV58701 59518 Class Libraries MTRCMWIN_X86-64.JCL FVT JAVA.NET.SOCKETEXCEPTION: SOCKET CLOSED 1 Functional Issue
IV56681 61452 Class Libraries NULLPOINTEREXCEPTION IS THROWN DURING AN LDAP SEARCH WHEN READ TIMEOUT IS NOT SPECIFIED AFTER APPLYING IV52561 1 Exception Thrown
IV60791 66425 Class Libraries PERFORMANCE IMPROVEMENTS FOR LARGE APPLICATIONS 1 Performance
IV59649 60567 Class Libraries SOFTWARE COMPRESSION USED EVEN THOUGH ZEDC EXPRESS HARDWARE ADAPTERS ARE AVAILABLE ON ZOS 1 Functional Issue
IV56621 55233 Class Libraries TEXT ON ‘OK’ BUTTON OF OPTIONPANE AND COLORCHOOSER IS NOT MEANINGFUL IN ITALIAN AND HUNGARIAN LOCALE. 1 Functional Issue
IV52647 56176 Class Libraries TIMEZONE ENTRY MISSING FOR ‘CHILE’ IN TZMAPPINGS FILE 1 Functional Issue
IV69000 84464 Class Libraries TRACE POINTS ENABLED FOR SOCKETEXCEPTION 1
IV52646 55308 Class Libraries UNSATISIFIED LINK ERROR IF LD_LIBRARY_PATH CONTAINS CONFLICTING LIBRARY WITH JAVA LIBRARIES ON LINUX 1 Functional Issue
IV58620 54999 Class Libraries VERIFY SIMILAR PROBABLE HANG SCENARIOS IN INPUT_METHOD_FRAMEWOR 1 Hang
IV59514 61326 Class Libraries ZEDC EXPRESS DECOMPRESSION NOT USED SOMETIMES ON Z/OS 1 Unexpected Behaviour
IV59513 54735 Class Libraries ZEDC HARDWARE COMPRESSES DATA EVEN WHEN COMPRESSION LEVEL IS SET TO ZERO ON Z/OS 1 Functional Issue
IV56736 61258 Java Virtual Machine A FINALIZED OBJECT REFERENCED BY A SOFTREFERENCE OR WEAKREFERENCE OBJECT IS NOT CLEARED PROPERLY. 1 Standards Noncompliance
IV57799 53967 Java Virtual Machine CRASH IN CACHEOBJECTMONITORFORLOO KUP 1 Crash
IV57802 56102 Java Virtual Machine DEADLOCK IN APPLICATIONS THAT USE JNI CRITICAL REGIONS 1 Functional Issue
IV58531 63072 Java Virtual Machine DEADLOCK WHILE INITIALIZING A CLASSLOADER AFTER APPLYING IV36441 1 Hang
IV59500 54020 Java Virtual Machine FIX SECURITY VULNERABILITY CVE-2014-0455 1 Functional Issue
IV58528 61440 Java Virtual Machine HOT TRACEPOINT TRC_MM_ALLOCATEANDCONNEC TNONCONTIGUOUSARRAYLET_E NTRY 1 Performance
IV55641 59600 Java Virtual Machine JAVA 7.1 ON Z890 FAILING ‘JAVA -VERSION’ COMMAND 1 Crash
IV59192 56105 Java Virtual Machine JAVA ERROR MESSAGE FOR INVALID -XLIMIT OPTIONS HAS A TRAILING ‘1’ 1 Functional Issue
IV55439 58803 Java Virtual Machine JAVA PROCESS NATIVE MEMORY LEAK ASSOCIATED WITH CLASS LOADING WHEN SHARED CLASSES IS ENABLED. 1 Out of Memory
IV58131 55704 Java Virtual Machine JAVA VM CRASHES WITHOUT CREATING A SYSTEM DUMP ON 64-BIT WINDOWS 1 Functional Issue
IV58640 59829 Java Virtual Machine JVM ASSERTS WHEN THE USER ATTEMPTS TO STORE A NEW CLASS IN SHARED CLASS CACHE USING COM.IBM.OTI.SHARED.SHARE DCLASSURLCLASSPATHHE 1 Crash
IV58314 61319 Java Virtual Machine JVM CRASHES WITH INVALID FREE IF RUN WITH EMPTY LD_LIBRARY_PATH 1 Crash
IV58522 55871 Java Virtual Machine JVM TI CRASH WHEN ITERATING OVER PARTIALLY ALLOCATED STRING. 1 Functional Issue
IV55245 58646 Java Virtual Machine JVM WRONGLY COMPARES THE BYTECODE OF A NATIVE METHOD DURING CLASSFILE RETRANSFORMATION/REDEFIN ITION REQUESTED BY A JAVA AGENT OR 1 Crash
IV56569 60336 Java Virtual Machine LE 4083-2 ABENDS FROM PTHREAD_EXIT DURING JVM SHUTDOWN 1 Crash
IV57808 62561 Java Virtual Machine OBJECT HEAP MIGHT BE NOT ALLOCATED IN LARGE PAGES IF -XMX VALUE IS NOT ALIGNED TO PAGE SIZE 1 Functional Issue
IV57387 61674 Java Virtual Machine POSSIBLE CRASH USING JSR292 1 Crash
IV55848 59912 Java Virtual Machine POSSIBLE PERFORMANCE DROP WHEN MULTIPLE JVMS ATTEMPT TO LOAD AND STORE THE SAME CLASS WHEN RUNNING WITH -XSHARECLASSES 1 Performance
IV58519 48885 Java Virtual Machine RACE CONDITION IN EXCEPTION HANDLING 1 Crash
IV58527 60665 Java Virtual Machine RUNNING JAVA APPLICATIONS WITH THE -XMT OPTION MAY RESULT IN A GPF (SEGMENTATION ERROR) 1 Crash
IV58521 56089 Java Virtual Machine RUNNING JAVA APPLICATIONS WITH THE -XMT OPTION MAY RESULT IN A GPF AFTER CALLING SYSTEM.EXIT() 1 Crash
IV58787 56044 Java Virtual Machine RUNNING JAVA APPLICATIONS WITH THE -XMT OPTION ON Z/OS PLATFORM MAY RESULT IN GARBLED OUTPUT BEING SEEN ON THE CONSOLE 1 Functional Issue
IV58526 59058 Java Virtual Machine SEGMENTATION FAULT WHEN SINGLE-STEPPING IN JAVA DEBUGGER 1 Crash
IV56469 60812 Java Virtual Machine SUBSEQUENT VM VERSIONS DO NOT HANDLE OBSOLETED JAVA 6 or Java 5 NON-PERSISTENT SHARED CACHE CONTROL FILES CORRECTLY WHEN 1 Hang
IV57795 54719 Java Virtual Machine UNABLE TO USE ANY OF UTILITY OPTIONS IN SHARED CLASSES CACHE WITH -XMT SPECIFIED ON THE COMMAND LINE 1 Functional Issue
IV58618 59623 JIT Compiler 64BIT LONG VALUES MAY BE INCORRECTLY TRUNCATED TO FEWER BITS IN JIT COMPILED CODE ON 64BIT X86 PLATFORMS 1 Hang
IV55957 59012 JIT Compiler ARRAYS.COPYOF MAY NOT CORRECTLY INITIALIZE DATA TO NULL 1 Unexpected Behaviour
IV56857 59192 JIT Compiler BUG IN JAVA JIT INLINING FOR METHOD INVOCATION VIA REFLECTION 1 Security Vulnerability
IV58707 62462 JIT Compiler CRASH OR NULLPOINTEREXCEPTION IN JITTED CODE 1 Crash
IV56526 60908 JIT Compiler HIGH CPU HANG IN JIT COMPILED METHOD 1 Hang
IV57317 60484 JIT Compiler ILLEGAL INSTRUCTION EXCEPTION IN COMPILED JAVA METHOD 1 Exception Thrown
IV57318 60477 JIT Compiler ILLEGAL INSTRUCTION EXCEPTION IN COMPILED JAVA METHOD ON Z/LINUX 1 Exception Thrown
IV55929 53869 JIT Compiler ILLEGAL INSTRUCTION EXCEPTION WITH SRST IN JIT-COMPILED METHOD 1 Crash
IV58136 60674 JIT Compiler INACCESSABLE ADDRESS WHEN RUNNING UNDER HCR MODE ON X86 PLATFORMS 1 Crash
IV59391 60112 JIT Compiler INCORRECT RESULT COMPARING WITH NAN VALUES ON SYSTEM Z 1 Functional Issue
IV58625 56258 JIT Compiler JAVA 7.1 APPLICATION ON S390 EXITS SILENTLY 1 Unexpected Behaviour
IV58520 56264 JIT Compiler JAVA 7.1 ARRAYINDEXOUTOFBOUNDSEXC EPTION INCORRECTLY THROWN IN DAA CONVERTUNICODEDECIMALTOP ACKEDDECIMAL METHOD 1 Unexpected Behaviour
IV58641 60970 JIT Compiler JAVA 7 PROGRAM CRASHES OR ENTERS AN INVALID STATE WHILE RUNNING IN FULL-SPEED DEBUGGING MODE 1 Exception Thrown
IV58794 60330 JIT Compiler JAVA JIT – EXCESSIVE COMPILATION REQUESTS FOR A SINGLE METHOD. 1 Query
IV58789 56229 JIT Compiler JIT COMPILER HANG 1 Hang
IV57732 60489 JIT Compiler JIT CRASH DURING COMPILATION WHEN RUNNING ON Z990 GA1 OR OLDER 1 Exception Thrown
IV58525 56314 JIT Compiler JVM CRASHES WITH UNHANDLED EXCEPTION 1 Crash
IV56735 59698 JIT Compiler JVM CRASH IN JITPREJNICALLOFFLOADCHECK 1 Crash
IV59515 61075 JIT Compiler PERFORMANCE DEGRADATION FROM JAVA 7.0 TO JAVA 7.1 ON X86 1 Performance
IV63630 56312 JIT Compiler PROGRAM CRASHES WITH ILLEGAL INSTRUCTION OR THROWS EXCEPTION in java.lang.UnsatisfiedLin kError ON X86 1 Exception Thrown
IV59629 56302 JIT Compiler RACE CONDITION WITH MUTABLECALLSITE 1 Exception Thrown
IV58790 56227 JIT Compiler STACK OVERFLOW IN JIT COMPILER 1 Crash
IX90136 56730 ORB INCORRECT EXCEPTIONS THROWN FROM THE ORB CODE DURING DE-MARSHALLING DUE TO EJB 2.0 EJB 3.0 MISMATCH 1
IX90135 53965 ORB NEGATIVEARRAYSIZEEXCEPTI ON THROWN FROM ORB CODE. 1
IX90142 56387 ORB NOSUCHMETHODERROR MAY BE SEEN DURING ORB EXCEPTION LOGGING 1 Exception Thrown
IX90138 61614 ORB NULLPOINTEREXCEPTION MAY BE THROWN FROM ORB CODE. 1 Exception Thrown
IX90137 58364 ORB THINCLIENT FAILURE WHILE DOING ORB INITIALIZATION 1
IV57386 59585 Reliability and Serviceability DTFJ API LOOPS WHILE WALKING JAVA THREADS 1 Hang
IV57394 55720 Reliability and Serviceability JVM CRASH OUTPUT METHOD_BEING_COMPILED INCORRECT 1 Usability
IV52659 55310 Service, Build, Packaging and Delivery 64 BIT RPM INSTALL FAILURE IF 32 BIT LIBSTDC++ IS MISSING IN THE SYSTEM 1 Functional Issue
IV54313 55312 Service, Build, Packaging and Delivery CHANGE OF JRE FOLDER OWNERSHIP IF INSTALLED USING INSTALL ANYWHERE 1 Packaging
IV58785 55077 Service, Build, Packaging and Delivery IN ZOS BUILDS, README.TXT AND NOTICES.TXT FILES ARE NOT CONVERTED PROPERLY INTO RESPECTIVE LOCALES 1 Unexpected Behaviour
IV59348 54928 Service, Build, Packaging and Delivery LOWER VERSION JDK .EXE PACKAGE UNABLE TO RESET THE HIGHER AS SYSTEM JVM ON UNINSTALL IN CASE OF MULTIPLE JDK CO-EXISTENCE ON WIN 1 Packaging
IV59349 54927 Service, Build, Packaging and Delivery STALE REGISTRY ENTRIES ON UNINSTALL OF .EXE PKG IN CASE OF MULTIPLE JDK CO-EXISTENCE ON WINDOWS 1 Functional Issue
IV55281 55318 Service, Build, Packaging and Delivery THE ‘PROPERTIES’ FOLDER IS MISSING IN JAVA_HOME POST A SUCCESSFUL JAVA INSTALL ON WINDOWS PLATFORM 1
IV58912 54843 Service, Build, Packaging and Delivery UNABLE TO VIEW INSTALLED LOCATION IN ADD/REMOVE PANEL FOR WINDOWS AMD64 JRE .EXE PACKAGE 1 Packaging
IV57733 62857 Security COM.IBM.SECURITY.JGSS.GS SUTIL NOT ACCESSIBLE 1 Usability
IV68757 60316 Security ELEMENTS ORDERING ISSUE IN CERTIFICATEEXTENSIONS 1
IV59570 54122 Security FIX SECURITY VULNERABILITY CVE-2014-0453 1 Functional Issue
IV59504 54031 Security FIX SECURITY VULNERABILITY CVE-2014-0454 1 Functional Issue
IV59630 58874 Security FIX SECURITY VULNERABILITY CVE-2014-0878 1 Functional Issue
IV55960 59196 Security JGSS SHOULD NOT THROW EXCEPTION WHEN MIC TOKEN IS NULL. 1 Exception Thrown
IV58795 61009 Security NULLPOINTEREXCEPTION WHEN PRINTING PRIVATEKEY 1 Exception Thrown
IV59033 62988 Security OAEP ALGORITHMPARAMETERS FROM ENCODED BYTES HAS INVALID MGF ALGORITHM NAME 1 Functional Issue
IV55739 60028 Security PBEKEY GETALGORITHM() RETURNS WRONG VALUE 1 Functional Issue
IV55946 58919 Security SASL THROWS NPE WHEN USING GSSAPI WITH LOG TRACE ON. 1 Unexpected Behaviour
IV58793 56891 Security SECRET GENERATED BY DHKEYAGREEMENT SHORTER THAN EXPECTED 1 Functional Issue
IV59032 59668 Security THE HMACSHA ALGORITHMS WERE REPAIRED WITHIN THE IBMPKCS11IMPL PROVIDER 1 Functional Issue
IV50703 73492 Security THE MICROSECONDS OF KERBEROSTIME WAS INCORRECTLY TRUNCATED 1 Functional Issue
IV55934 59804 Security TLSV1.2 FAILED TO WORK WITH RSA CIPHER SUITE IN FIPS MODE. 1 Unexpected Behaviour
IV56230 57052 Security TLSV1.2 FAILED TO WORK WITH RSTHE IMPLEMENTATION DOES NOT USE THE NODESETDATA INTERFACE.A CIPHER SUITE IN FIPS MODE. 1 Functional Issue
IV58700 59632 Security XMLDSIG ATTACH DEFAULT NAMESPACE PREFIX TO ELEMENTS 1 Security Vulnerability

7.1 GA Release